This thread has been locked.
If you have a related question, please click the "Ask a related question" button in the top right corner. The newly created question will be automatically linked to this question.
Part Number: PROCESSOR-SDK-DRA8X-TDA4X
Dear experts,
I'm following the steps on "Vision apps user guide" and I run this command in step 3 in Run Instruction: make linux_fs_install_sd
I got the following error:
As you can see bellow, there is no folder named 'out' in vision_apps directory
Do you have any idea where I can find /ou/J7/A72...?
Thanks,
Brahim
Hi Brahim,
Have you taken care of the precondition in the Note as mentioned in this section?
Regards
Karthik
Hi Karthik,
Yes I did every mentioned step, I got that error when I run make linux_fs_install_sd.
In vision _apps folder I have the folder "out" but inside "out" I don't have J7, I have a folder named PC.
I have this: Vision_apps ==> out ==> PC ==> x86_64 ==> LINUX ==> release
In the error message, it seems that I need this: Vision_apps ==> out ==> J7 ==> A72 ==> LINUX ==> release
Please check,
Brahim
Hi Brahim,
It seems like your build flags may only be set to build PC. Could you please see if you have BUILD_TARGET_MODE defined in your environment by running "echo $BUILD_TARGET_MODE"? If it is not defined, could you see what it is set to inside tiovx/build_flags.mak? It should be set to "yes" either in your environment or in this file.
Could you please also send me the console output of running "make vision_apps"?
Regards,
Lucas
Hi Lucas,
It seems like BUILD_TARGET_MODE is not defined as you see below:
I opened tiovx/build_flags.mak and I found the BUILD_TARGET_MODE set to "no", I changed it to "yes"
I also opened vision_apps/vision_apps_build_flags.mak and I didn't any variable named BUILD_TARGET_MODE.
Here is the output of make vision_apps command (it's the first time I do it, it seems there is an error at the end):
a0487976@brahim-VM:~/ti-j7-rtos/psdk_rtos_auto_j7_06_02_00_21/vision_apps$ make vision_apps
SHELL=/bin/sh
TARGET_MAKEFILES=applibs/srv_bowl_lut_gen_applib/concerto.mak applibs/srv_calibration_applib/concerto.mak applibs/test/concerto.mak apps/basic_demos/app_c7x_kernel/c7x/concerto.mak apps/basic_demos/app_c7x_kernel/concerto.mak apps/basic_demos/app_dof/concerto.mak apps/basic_demos/app_dof2/concerto.mak apps/basic_demos/app_ipc/concerto.mak apps/basic_demos/app_linux_arm_opengl_mosaic/concerto.mak apps/basic_demos/app_mem/concerto.mak apps/basic_demos/app_multi_cam/concerto.mak apps/basic_demos/app_remote_log/concerto.mak apps/basic_demos/app_single_cam/concerto.mak apps/basic_demos/app_stereo/concerto.mak apps/basic_demos/app_test_framework/concerto.mak apps/basic_demos/app_tirtos/common/concerto.mak apps/basic_demos/app_tirtos/tirtos_linux/c66x_1/concerto.mak apps/basic_demos/app_tirtos/tirtos_linux/c66x_2/concerto.mak apps/basic_demos/app_tirtos/tirtos_linux/c7x_1/concerto.mak apps/basic_demos/app_tirtos/tirtos_linux/mcu1_0/concerto.mak apps/basic_demos/app_tirtos/tirtos_linux/mcu1_1/concerto.mak apps/basic_demos/app_tirtos/tirtos_linux/mcu2_0/concerto.mak apps/basic_demos/app_tirtos/tirtos_linux/mcu2_1/concerto.mak apps/basic_demos/app_tirtos/tirtos_linux/mcu3_0/concerto.mak apps/basic_demos/app_tirtos/tirtos_linux/mcu3_1/concerto.mak apps/basic_demos/app_tirtos/tirtos_linux/mpu1/concerto.mak apps/basic_demos/app_tirtos/tirtos_qnx/c66x_1/concerto.mak apps/basic_demos/app_tirtos/tirtos_qnx/c66x_2/concerto.mak apps/basic_demos/app_tirtos/tirtos_qnx/c7x_1/concerto.mak apps/basic_demos/app_tirtos/tirtos_qnx/mcu1_0/concerto.mak apps/basic_demos/app_tirtos/tirtos_qnx/mcu1_1/concerto.mak apps/basic_demos/app_tirtos/tirtos_qnx/mcu2_0/concerto.mak apps/basic_demos/app_tirtos/tirtos_qnx/mcu2_1/concerto.mak apps/basic_demos/app_tirtos/tirtos_qnx/mcu3_0/concerto.mak apps/basic_demos/app_tirtos/tirtos_qnx/mcu3_1/concerto.mak apps/basic_demos/app_tirtos/tirtos_qnx/mpu1/concerto.mak apps/basic_demos/app_vx_conformance/concerto.mak apps/basic_demos/app_vx_tutorial/concerto.mak apps/cockpit_demos/app_tirtos_linux/concerto.mak apps/dl_demos/app_tidl/concerto.mak apps/dl_demos/app_tidl_avp/concerto.mak apps/dl_demos/app_tidl_avp2/concerto.mak apps/dl_demos/app_tidl_avp3/concerto.mak apps/dl_demos/app_visual_localization/concerto.mak apps/iohub_demos/app_pcie_video_sink/concerto.mak apps/iohub_demos/app_pcie_video_source/concerto.mak apps/ptk_demos/app_common/concerto.mak apps/ptk_demos/app_dof_sfm_fisheye/concerto.mak apps/ptk_demos/app_lidar_ogmap/concerto.mak apps/ptk_demos/app_radar_gtrack/concerto.mak apps/ptk_demos/app_sde_obstacle_detection/concerto.mak apps/ptk_demos/app_surround_radar_ogmap/concerto.mak apps/ptk_demos/app_valet_parking/concerto.mak apps/ptk_demos/applibs/fused_ogmap_applib/concerto.mak apps/ptk_demos/applibs/lidar_ogmap_applib/concerto.mak apps/ptk_demos/applibs/ps_mapping_applib/concerto.mak apps/ptk_demos/applibs/radar_gtrack_applib/concerto.mak apps/ptk_demos/applibs/sde_obstacle_detection_applib/concerto.mak apps/ptk_demos/applibs/surround_radar_ogmap_applib/concerto.mak apps/ptk_demos/applibs/surround_sfm_ogmap_applib/concerto.mak apps/srv_demos/app_srv_calibration/concerto.mak apps/srv_demos/app_srv_camera/concerto.mak apps/srv_demos/app_srv_fileio/concerto.mak kernels/common/target/concerto.mak kernels/img_proc/arm/concerto.mak kernels/img_proc/c66/concerto.mak kernels/img_proc/host/concerto.mak kernels/lidar/arm/concerto.mak kernels/lidar/host/concerto.mak kernels/park_assist/host/concerto.mak kernels/park_assist/target/concerto.mak kernels/sample/a72/concerto.mak kernels/sample/host/concerto.mak kernels/sample/r5f/concerto.mak kernels/srv/c66/concerto.mak kernels/srv/gpu/3dsrv/Tools/concerto.mak kernels/srv/gpu/3dsrv/concerto.mak kernels/srv/gpu/concerto.mak kernels/srv/host/concerto.mak kernels/srv/test/concerto.mak kernels/stereo/host/concerto.mak kernels/stereo/target/bam/concerto.mak kernels/stereo/target/concerto.mak kernels/stereo/test/concerto.mak utils/console_io/src/concerto.mak utils/draw2d/src/concerto.mak utils/dss/src/concerto.mak utils/grpx/src/concerto.mak utils/hwa/src/concerto.mak utils/ipc/src/concerto.mak utils/iss/src/concerto.mak utils/mem/src/concerto.mak utils/misc/src/concerto.mak utils/mmc_sd/src/concerto.mak utils/opengl/src/a72/concerto.mak utils/opengl/src/pc/concerto.mak utils/pcie/src/concerto.mak utils/perf_stats/src/concerto.mak utils/remote_service/src/concerto.mak utils/sciclient/src/concerto.mak utils/sensors/src/concerto.mak utils/udma/src/concerto.mak
file TIARMCGT_ROOT=$(PSDK_PATH)/ti-cgt-arm_18.12.1.LTS
file GCC_SYSBIOS_ARM_ROOT=$(PSDK_PATH)/gcc-linaro-7.2.1-2017.11-x86_64_aarch64-elf
file CGT6X_ROOT=$(PSDK_PATH)/ti-cgt-c6000_8.3.2
file CGT7X_ROOT=$(PSDK_PATH)/ti-cgt-c7000_1.2.0.STS
undefined GCC_WINDOWS_ROOT=
file GCC_LINUX_ROOT=/usr/
file GCC_QNX_ROOT=$(QNX_HOST)/usr/bin
#######################################################################
TARGET_COMBO=J7:SYSBIOS:R5F:3:debug:TIARMCGT
HOST_ROOT=/home/a0487976/ti-j7-rtos/psdk_rtos_auto_j7_06_02_00_21/vision_apps
HOST_COMPILER=TIARMCGT
HOST_PLATFORM=PC
HOST_OS=LINUX
HOST_CPU=x86_64
HOST_ARCH=64
HOST_FAMILY=x86_64
HOST_NUM_CORES=1
TARGET_OS=SYSBIOS
TARGET_CPU=R5F
TARGET_ARCH=32
TARGET_FAMILY=ARM
TARGET_NUM_CORES=3
TARGET_PLATFORM=J7
TARGET_BUILD=debug
TARGET_OUT=/home/a0487976/ti-j7-rtos/psdk_rtos_auto_j7_06_02_00_21/vision_apps/out/J7/R5F/SYSBIOS/debug
TARGET_DOC=/home/a0487976/ti-j7-rtos/psdk_rtos_auto_j7_06_02_00_21/vision_apps/out/J7/R5F/SYSBIOS/debug/docs
BUILD_DEFS = CUSTOM_KERNEL_PATH BUILD_TUTORIAL BUILD_CONFORMANCE_TEST
J7_SYSBIOS_R5F_3_debug_TIARMCGT_DEFS = SYSBIOS J7 R5F="R5F" TARGET_NUM_CORES=3 TARGET_ARCH=32 ARCH_32 ARM TARGET_BUILD=2
J7_SYSBIOS_R5F_3_debug_TIARMCGT_LDIRS =
SCM_ROOT=
SCM_VERSION=
#######################################################################
TARGET_COMBO=J7:SYSBIOS:A72:1:debug:GCC_SYSBIOS_ARM
HOST_ROOT=/home/a0487976/ti-j7-rtos/psdk_rtos_auto_j7_06_02_00_21/vision_apps
HOST_COMPILER=GCC_SYSBIOS_ARM
HOST_PLATFORM=PC
HOST_OS=LINUX
HOST_CPU=x86_64
HOST_ARCH=64
HOST_FAMILY=x86_64
HOST_NUM_CORES=1
TARGET_OS=SYSBIOS
TARGET_CPU=A72
TARGET_ARCH=64
TARGET_FAMILY=ARM
TARGET_NUM_CORES=1
TARGET_PLATFORM=J7
TARGET_BUILD=debug
TARGET_OUT=/home/a0487976/ti-j7-rtos/psdk_rtos_auto_j7_06_02_00_21/vision_apps/out/J7/A72/SYSBIOS/debug
TARGET_DOC=/home/a0487976/ti-j7-rtos/psdk_rtos_auto_j7_06_02_00_21/vision_apps/out/J7/A72/SYSBIOS/debug/docs
BUILD_DEFS = CUSTOM_KERNEL_PATH BUILD_TUTORIAL BUILD_CONFORMANCE_TEST
J7_SYSBIOS_A72_1_debug_GCC_SYSBIOS_ARM_DEFS = SYSBIOS J7 A72="A72" TARGET_NUM_CORES=1 TARGET_ARCH=64 ARCH_64 ARM TARGET_BUILD=2
J7_SYSBIOS_A72_1_debug_GCC_SYSBIOS_ARM_LDIRS =
SCM_ROOT=
SCM_VERSION=
Build Skipped for kernels.stereo.target.bam.J7.SYSBIOS.A72.debug:vx_target_kernels_stereo_bam
#######################################################################
TARGET_COMBO=J7:SYSBIOS:C66:2:debug:CGT6X
HOST_ROOT=/home/a0487976/ti-j7-rtos/psdk_rtos_auto_j7_06_02_00_21/vision_apps
HOST_COMPILER=CGT6X
HOST_PLATFORM=PC
HOST_OS=LINUX
HOST_CPU=x86_64
HOST_ARCH=64
HOST_FAMILY=x86_64
HOST_NUM_CORES=1
TARGET_OS=SYSBIOS
TARGET_CPU=C66
TARGET_ARCH=32
TARGET_FAMILY=DSP
TARGET_NUM_CORES=2
TARGET_PLATFORM=J7
TARGET_BUILD=debug
TARGET_OUT=/home/a0487976/ti-j7-rtos/psdk_rtos_auto_j7_06_02_00_21/vision_apps/out/J7/C66/SYSBIOS/debug
TARGET_DOC=/home/a0487976/ti-j7-rtos/psdk_rtos_auto_j7_06_02_00_21/vision_apps/out/J7/C66/SYSBIOS/debug/docs
BUILD_DEFS = CUSTOM_KERNEL_PATH BUILD_TUTORIAL BUILD_CONFORMANCE_TEST
J7_SYSBIOS_C66_2_debug_CGT6X_DEFS = SYSBIOS J7 C66="C66" TARGET_NUM_CORES=2 TARGET_ARCH=32 ARCH_32 DSP TARGET_BUILD=2
J7_SYSBIOS_C66_2_debug_CGT6X_LDIRS =
SCM_ROOT=
SCM_VERSION=
Build Skipped for kernels.stereo.target.bam.J7.SYSBIOS.C66.debug:vx_target_kernels_stereo_bam
#######################################################################
TARGET_COMBO=J7:SYSBIOS:C71:1:debug:CGT7X
HOST_ROOT=/home/a0487976/ti-j7-rtos/psdk_rtos_auto_j7_06_02_00_21/vision_apps
HOST_COMPILER=CGT7X
HOST_PLATFORM=PC
HOST_OS=LINUX
HOST_CPU=x86_64
HOST_ARCH=64
HOST_FAMILY=x86_64
HOST_NUM_CORES=1
TARGET_OS=SYSBIOS
TARGET_CPU=C71
TARGET_ARCH=64
TARGET_FAMILY=DSP
TARGET_NUM_CORES=1
TARGET_PLATFORM=J7
TARGET_BUILD=debug
TARGET_OUT=/home/a0487976/ti-j7-rtos/psdk_rtos_auto_j7_06_02_00_21/vision_apps/out/J7/C71/SYSBIOS/debug
TARGET_DOC=/home/a0487976/ti-j7-rtos/psdk_rtos_auto_j7_06_02_00_21/vision_apps/out/J7/C71/SYSBIOS/debug/docs
BUILD_DEFS = CUSTOM_KERNEL_PATH BUILD_TUTORIAL BUILD_CONFORMANCE_TEST
J7_SYSBIOS_C71_1_debug_CGT7X_DEFS = SYSBIOS J7 C71="C71" TARGET_NUM_CORES=1 TARGET_ARCH=64 ARCH_64 DSP TARGET_BUILD=2
J7_SYSBIOS_C71_1_debug_CGT7X_LDIRS =
SCM_ROOT=
SCM_VERSION=
#######################################################################
TARGET_COMBO=J7:LINUX:A72:1:debug:GCC_LINUX_ARM
HOST_ROOT=/home/a0487976/ti-j7-rtos/psdk_rtos_auto_j7_06_02_00_21/vision_apps
HOST_COMPILER=GCC_LINUX_ARM
HOST_PLATFORM=PC
HOST_OS=LINUX
HOST_CPU=x86_64
HOST_ARCH=64
HOST_FAMILY=x86_64
HOST_NUM_CORES=1
TARGET_OS=LINUX
TARGET_CPU=A72
TARGET_ARCH=64
TARGET_FAMILY=ARM
TARGET_NUM_CORES=1
TARGET_PLATFORM=J7
TARGET_BUILD=debug
TARGET_OUT=/home/a0487976/ti-j7-rtos/psdk_rtos_auto_j7_06_02_00_21/vision_apps/out/J7/A72/LINUX/debug
TARGET_DOC=/home/a0487976/ti-j7-rtos/psdk_rtos_auto_j7_06_02_00_21/vision_apps/out/J7/A72/LINUX/debug/docs
BUILD_DEFS = CUSTOM_KERNEL_PATH BUILD_TUTORIAL BUILD_CONFORMANCE_TEST
J7_LINUX_A72_1_debug_GCC_LINUX_ARM_DEFS = LINUX J7 A72="A72" TARGET_NUM_CORES=1 TARGET_ARCH=64 ARCH_64 ARM TARGET_BUILD=2
J7_LINUX_A72_1_debug_GCC_LINUX_ARM_LDIRS =
SCM_ROOT=
SCM_VERSION=
Build Skipped for kernels.stereo.target.bam.J7.LINUX.A72.debug:vx_target_kernels_stereo_bam
#######################################################################
TARGET_COMBO=J7:SYSBIOS:R5F:3:release:TIARMCGT
HOST_ROOT=/home/a0487976/ti-j7-rtos/psdk_rtos_auto_j7_06_02_00_21/vision_apps
HOST_COMPILER=TIARMCGT
HOST_PLATFORM=PC
HOST_OS=LINUX
HOST_CPU=x86_64
HOST_ARCH=64
HOST_FAMILY=x86_64
HOST_NUM_CORES=1
TARGET_OS=SYSBIOS
TARGET_CPU=R5F
TARGET_ARCH=32
TARGET_FAMILY=ARM
TARGET_NUM_CORES=3
TARGET_PLATFORM=J7
TARGET_BUILD=release
TARGET_OUT=/home/a0487976/ti-j7-rtos/psdk_rtos_auto_j7_06_02_00_21/vision_apps/out/J7/R5F/SYSBIOS/release
TARGET_DOC=/home/a0487976/ti-j7-rtos/psdk_rtos_auto_j7_06_02_00_21/vision_apps/out/J7/R5F/SYSBIOS/release/docs
BUILD_DEFS = CUSTOM_KERNEL_PATH BUILD_TUTORIAL BUILD_CONFORMANCE_TEST
J7_SYSBIOS_R5F_3_release_TIARMCGT_DEFS = SYSBIOS J7 R5F="R5F" TARGET_NUM_CORES=3 TARGET_ARCH=32 ARCH_32 ARM TARGET_BUILD=1
J7_SYSBIOS_R5F_3_release_TIARMCGT_LDIRS =
SCM_ROOT=
SCM_VERSION=
#######################################################################
TARGET_COMBO=J7:SYSBIOS:A72:1:release:GCC_SYSBIOS_ARM
HOST_ROOT=/home/a0487976/ti-j7-rtos/psdk_rtos_auto_j7_06_02_00_21/vision_apps
HOST_COMPILER=GCC_SYSBIOS_ARM
HOST_PLATFORM=PC
HOST_OS=LINUX
HOST_CPU=x86_64
HOST_ARCH=64
HOST_FAMILY=x86_64
HOST_NUM_CORES=1
TARGET_OS=SYSBIOS
TARGET_CPU=A72
TARGET_ARCH=64
TARGET_FAMILY=ARM
TARGET_NUM_CORES=1
TARGET_PLATFORM=J7
TARGET_BUILD=release
TARGET_OUT=/home/a0487976/ti-j7-rtos/psdk_rtos_auto_j7_06_02_00_21/vision_apps/out/J7/A72/SYSBIOS/release
TARGET_DOC=/home/a0487976/ti-j7-rtos/psdk_rtos_auto_j7_06_02_00_21/vision_apps/out/J7/A72/SYSBIOS/release/docs
BUILD_DEFS = CUSTOM_KERNEL_PATH BUILD_TUTORIAL BUILD_CONFORMANCE_TEST
J7_SYSBIOS_A72_1_release_GCC_SYSBIOS_ARM_DEFS = SYSBIOS J7 A72="A72" TARGET_NUM_CORES=1 TARGET_ARCH=64 ARCH_64 ARM TARGET_BUILD=1
J7_SYSBIOS_A72_1_release_GCC_SYSBIOS_ARM_LDIRS =
SCM_ROOT=
SCM_VERSION=
Build Skipped for kernels.stereo.target.bam.J7.SYSBIOS.A72.release:vx_target_kernels_stereo_bam
#######################################################################
TARGET_COMBO=J7:SYSBIOS:C66:2:release:CGT6X
HOST_ROOT=/home/a0487976/ti-j7-rtos/psdk_rtos_auto_j7_06_02_00_21/vision_apps
HOST_COMPILER=CGT6X
HOST_PLATFORM=PC
HOST_OS=LINUX
HOST_CPU=x86_64
HOST_ARCH=64
HOST_FAMILY=x86_64
HOST_NUM_CORES=1
TARGET_OS=SYSBIOS
TARGET_CPU=C66
TARGET_ARCH=32
TARGET_FAMILY=DSP
TARGET_NUM_CORES=2
TARGET_PLATFORM=J7
TARGET_BUILD=release
TARGET_OUT=/home/a0487976/ti-j7-rtos/psdk_rtos_auto_j7_06_02_00_21/vision_apps/out/J7/C66/SYSBIOS/release
TARGET_DOC=/home/a0487976/ti-j7-rtos/psdk_rtos_auto_j7_06_02_00_21/vision_apps/out/J7/C66/SYSBIOS/release/docs
BUILD_DEFS = CUSTOM_KERNEL_PATH BUILD_TUTORIAL BUILD_CONFORMANCE_TEST
J7_SYSBIOS_C66_2_release_CGT6X_DEFS = SYSBIOS J7 C66="C66" TARGET_NUM_CORES=2 TARGET_ARCH=32 ARCH_32 DSP TARGET_BUILD=1
J7_SYSBIOS_C66_2_release_CGT6X_LDIRS =
SCM_ROOT=
SCM_VERSION=
Build Skipped for kernels.stereo.target.bam.J7.SYSBIOS.C66.release:vx_target_kernels_stereo_bam
#######################################################################
TARGET_COMBO=J7:SYSBIOS:C71:1:release:CGT7X
HOST_ROOT=/home/a0487976/ti-j7-rtos/psdk_rtos_auto_j7_06_02_00_21/vision_apps
HOST_COMPILER=CGT7X
HOST_PLATFORM=PC
HOST_OS=LINUX
HOST_CPU=x86_64
HOST_ARCH=64
HOST_FAMILY=x86_64
HOST_NUM_CORES=1
TARGET_OS=SYSBIOS
TARGET_CPU=C71
TARGET_ARCH=64
TARGET_FAMILY=DSP
TARGET_NUM_CORES=1
TARGET_PLATFORM=J7
TARGET_BUILD=release
TARGET_OUT=/home/a0487976/ti-j7-rtos/psdk_rtos_auto_j7_06_02_00_21/vision_apps/out/J7/C71/SYSBIOS/release
TARGET_DOC=/home/a0487976/ti-j7-rtos/psdk_rtos_auto_j7_06_02_00_21/vision_apps/out/J7/C71/SYSBIOS/release/docs
BUILD_DEFS = CUSTOM_KERNEL_PATH BUILD_TUTORIAL BUILD_CONFORMANCE_TEST
J7_SYSBIOS_C71_1_release_CGT7X_DEFS = SYSBIOS J7 C71="C71" TARGET_NUM_CORES=1 TARGET_ARCH=64 ARCH_64 DSP TARGET_BUILD=1
J7_SYSBIOS_C71_1_release_CGT7X_LDIRS =
SCM_ROOT=
SCM_VERSION=
#######################################################################
TARGET_COMBO=J7:LINUX:A72:1:release:GCC_LINUX_ARM
HOST_ROOT=/home/a0487976/ti-j7-rtos/psdk_rtos_auto_j7_06_02_00_21/vision_apps
HOST_COMPILER=GCC_LINUX_ARM
HOST_PLATFORM=PC
HOST_OS=LINUX
HOST_CPU=x86_64
HOST_ARCH=64
HOST_FAMILY=x86_64
HOST_NUM_CORES=1
TARGET_OS=LINUX
TARGET_CPU=A72
TARGET_ARCH=64
TARGET_FAMILY=ARM
TARGET_NUM_CORES=1
TARGET_PLATFORM=J7
TARGET_BUILD=release
TARGET_OUT=/home/a0487976/ti-j7-rtos/psdk_rtos_auto_j7_06_02_00_21/vision_apps/out/J7/A72/LINUX/release
TARGET_DOC=/home/a0487976/ti-j7-rtos/psdk_rtos_auto_j7_06_02_00_21/vision_apps/out/J7/A72/LINUX/release/docs
BUILD_DEFS = CUSTOM_KERNEL_PATH BUILD_TUTORIAL BUILD_CONFORMANCE_TEST
J7_LINUX_A72_1_release_GCC_LINUX_ARM_DEFS = LINUX J7 A72="A72" TARGET_NUM_CORES=1 TARGET_ARCH=64 ARCH_64 ARM TARGET_BUILD=1
J7_LINUX_A72_1_release_GCC_LINUX_ARM_LDIRS =
SCM_ROOT=
SCM_VERSION=
Build Skipped for kernels.stereo.target.bam.J7.LINUX.A72.release:vx_target_kernels_stereo_bam
#######################################################################
TARGET_COMBO=PC:LINUX:x86_64:1:debug:GCC_LINUX
HOST_ROOT=/home/a0487976/ti-j7-rtos/psdk_rtos_auto_j7_06_02_00_21/vision_apps
HOST_COMPILER=GCC_LINUX
HOST_PLATFORM=PC
HOST_OS=LINUX
HOST_CPU=x86_64
HOST_ARCH=64
HOST_FAMILY=x86_64
HOST_NUM_CORES=1
TARGET_OS=LINUX
TARGET_CPU=x86_64
TARGET_ARCH=64
TARGET_FAMILY=x86_64
TARGET_NUM_CORES=1
TARGET_PLATFORM=PC
TARGET_BUILD=debug
TARGET_OUT=/home/a0487976/ti-j7-rtos/psdk_rtos_auto_j7_06_02_00_21/vision_apps/out/PC/x86_64/LINUX/debug
TARGET_DOC=/home/a0487976/ti-j7-rtos/psdk_rtos_auto_j7_06_02_00_21/vision_apps/out/PC/x86_64/LINUX/debug/docs
BUILD_DEFS = CUSTOM_KERNEL_PATH BUILD_TUTORIAL BUILD_CONFORMANCE_TEST
PC_LINUX_x86_64_1_debug_GCC_LINUX_DEFS = LINUX PC x86_64="x86_64" TARGET_NUM_CORES=1 TARGET_ARCH=64 ARCH_64 TARGET_BUILD=2
PC_LINUX_x86_64_1_debug_GCC_LINUX_LDIRS =
SCM_ROOT=
SCM_VERSION=
Build Skipped for kernels.stereo.target.bam.PC.LINUX.x86_64.debug:vx_target_kernels_stereo_bam
#######################################################################
TARGET_COMBO=PC:LINUX:x86_64:1:release:GCC_LINUX
HOST_ROOT=/home/a0487976/ti-j7-rtos/psdk_rtos_auto_j7_06_02_00_21/vision_apps
HOST_COMPILER=GCC_LINUX
HOST_PLATFORM=PC
HOST_OS=LINUX
HOST_CPU=x86_64
HOST_ARCH=64
HOST_FAMILY=x86_64
HOST_NUM_CORES=1
TARGET_OS=LINUX
TARGET_CPU=x86_64
TARGET_ARCH=64
TARGET_FAMILY=x86_64
TARGET_NUM_CORES=1
TARGET_PLATFORM=PC
TARGET_BUILD=release
TARGET_OUT=/home/a0487976/ti-j7-rtos/psdk_rtos_auto_j7_06_02_00_21/vision_apps/out/PC/x86_64/LINUX/release
TARGET_DOC=/home/a0487976/ti-j7-rtos/psdk_rtos_auto_j7_06_02_00_21/vision_apps/out/PC/x86_64/LINUX/release/docs
BUILD_DEFS = CUSTOM_KERNEL_PATH BUILD_TUTORIAL BUILD_CONFORMANCE_TEST
PC_LINUX_x86_64_1_release_GCC_LINUX_DEFS = LINUX PC x86_64="x86_64" TARGET_NUM_CORES=1 TARGET_ARCH=64 ARCH_64 TARGET_BUILD=1
PC_LINUX_x86_64_1_release_GCC_LINUX_LDIRS =
SCM_ROOT=
SCM_VERSION=
Build Skipped for kernels.stereo.target.bam.PC.LINUX.x86_64.release:vx_target_kernels_stereo_bam
# SDK paths OK !!!
make all
make[1]: Entering directory '/home/a0487976/ti-j7-rtos/psdk_rtos_auto_j7_06_02_00_21/vision_apps'
SHELL=/bin/sh
TARGET_MAKEFILES=applibs/srv_bowl_lut_gen_applib/concerto.mak applibs/srv_calibration_applib/concerto.mak applibs/test/concerto.mak apps/basic_demos/app_c7x_kernel/c7x/concerto.mak apps/basic_demos/app_c7x_kernel/concerto.mak apps/basic_demos/app_dof/concerto.mak apps/basic_demos/app_dof2/concerto.mak apps/basic_demos/app_ipc/concerto.mak apps/basic_demos/app_linux_arm_opengl_mosaic/concerto.mak apps/basic_demos/app_mem/concerto.mak apps/basic_demos/app_multi_cam/concerto.mak apps/basic_demos/app_remote_log/concerto.mak apps/basic_demos/app_single_cam/concerto.mak apps/basic_demos/app_stereo/concerto.mak apps/basic_demos/app_test_framework/concerto.mak apps/basic_demos/app_tirtos/common/concerto.mak apps/basic_demos/app_tirtos/tirtos_linux/c66x_1/concerto.mak apps/basic_demos/app_tirtos/tirtos_linux/c66x_2/concerto.mak apps/basic_demos/app_tirtos/tirtos_linux/c7x_1/concerto.mak apps/basic_demos/app_tirtos/tirtos_linux/mcu1_0/concerto.mak apps/basic_demos/app_tirtos/tirtos_linux/mcu1_1/concerto.mak apps/basic_demos/app_tirtos/tirtos_linux/mcu2_0/concerto.mak apps/basic_demos/app_tirtos/tirtos_linux/mcu2_1/concerto.mak apps/basic_demos/app_tirtos/tirtos_linux/mcu3_0/concerto.mak apps/basic_demos/app_tirtos/tirtos_linux/mcu3_1/concerto.mak apps/basic_demos/app_tirtos/tirtos_linux/mpu1/concerto.mak apps/basic_demos/app_tirtos/tirtos_qnx/c66x_1/concerto.mak apps/basic_demos/app_tirtos/tirtos_qnx/c66x_2/concerto.mak apps/basic_demos/app_tirtos/tirtos_qnx/c7x_1/concerto.mak apps/basic_demos/app_tirtos/tirtos_qnx/mcu1_0/concerto.mak apps/basic_demos/app_tirtos/tirtos_qnx/mcu1_1/concerto.mak apps/basic_demos/app_tirtos/tirtos_qnx/mcu2_0/concerto.mak apps/basic_demos/app_tirtos/tirtos_qnx/mcu2_1/concerto.mak apps/basic_demos/app_tirtos/tirtos_qnx/mcu3_0/concerto.mak apps/basic_demos/app_tirtos/tirtos_qnx/mcu3_1/concerto.mak apps/basic_demos/app_tirtos/tirtos_qnx/mpu1/concerto.mak apps/basic_demos/app_vx_conformance/concerto.mak apps/basic_demos/app_vx_tutorial/concerto.mak apps/cockpit_demos/app_tirtos_linux/concerto.mak apps/dl_demos/app_tidl/concerto.mak apps/dl_demos/app_tidl_avp/concerto.mak apps/dl_demos/app_tidl_avp2/concerto.mak apps/dl_demos/app_tidl_avp3/concerto.mak apps/dl_demos/app_visual_localization/concerto.mak apps/iohub_demos/app_pcie_video_sink/concerto.mak apps/iohub_demos/app_pcie_video_source/concerto.mak apps/ptk_demos/app_common/concerto.mak apps/ptk_demos/app_dof_sfm_fisheye/concerto.mak apps/ptk_demos/app_lidar_ogmap/concerto.mak apps/ptk_demos/app_radar_gtrack/concerto.mak apps/ptk_demos/app_sde_obstacle_detection/concerto.mak apps/ptk_demos/app_surround_radar_ogmap/concerto.mak apps/ptk_demos/app_valet_parking/concerto.mak apps/ptk_demos/applibs/fused_ogmap_applib/concerto.mak apps/ptk_demos/applibs/lidar_ogmap_applib/concerto.mak apps/ptk_demos/applibs/ps_mapping_applib/concerto.mak apps/ptk_demos/applibs/radar_gtrack_applib/concerto.mak apps/ptk_demos/applibs/sde_obstacle_detection_applib/concerto.mak apps/ptk_demos/applibs/surround_radar_ogmap_applib/concerto.mak apps/ptk_demos/applibs/surround_sfm_ogmap_applib/concerto.mak apps/srv_demos/app_srv_calibration/concerto.mak apps/srv_demos/app_srv_camera/concerto.mak apps/srv_demos/app_srv_fileio/concerto.mak kernels/common/target/concerto.mak kernels/img_proc/arm/concerto.mak kernels/img_proc/c66/concerto.mak kernels/img_proc/host/concerto.mak kernels/lidar/arm/concerto.mak kernels/lidar/host/concerto.mak kernels/park_assist/host/concerto.mak kernels/park_assist/target/concerto.mak kernels/sample/a72/concerto.mak kernels/sample/host/concerto.mak kernels/sample/r5f/concerto.mak kernels/srv/c66/concerto.mak kernels/srv/gpu/3dsrv/Tools/concerto.mak kernels/srv/gpu/3dsrv/concerto.mak kernels/srv/gpu/concerto.mak kernels/srv/host/concerto.mak kernels/srv/test/concerto.mak kernels/stereo/host/concerto.mak kernels/stereo/target/bam/concerto.mak kernels/stereo/target/concerto.mak kernels/stereo/test/concerto.mak utils/console_io/src/concerto.mak utils/draw2d/src/concerto.mak utils/dss/src/concerto.mak utils/grpx/src/concerto.mak utils/hwa/src/concerto.mak utils/ipc/src/concerto.mak utils/iss/src/concerto.mak utils/mem/src/concerto.mak utils/misc/src/concerto.mak utils/mmc_sd/src/concerto.mak utils/opengl/src/a72/concerto.mak utils/opengl/src/pc/concerto.mak utils/pcie/src/concerto.mak utils/perf_stats/src/concerto.mak utils/remote_service/src/concerto.mak utils/sciclient/src/concerto.mak utils/sensors/src/concerto.mak utils/udma/src/concerto.mak
file TIARMCGT_ROOT=$(PSDK_PATH)/ti-cgt-arm_18.12.1.LTS
file GCC_SYSBIOS_ARM_ROOT=$(PSDK_PATH)/gcc-linaro-7.2.1-2017.11-x86_64_aarch64-elf
file CGT6X_ROOT=$(PSDK_PATH)/ti-cgt-c6000_8.3.2
file CGT7X_ROOT=$(PSDK_PATH)/ti-cgt-c7000_1.2.0.STS
undefined GCC_WINDOWS_ROOT=
file GCC_LINUX_ROOT=/usr/
environment GCC_QNX_ROOT=/home/a0487976/ti-j7-rtos/psdk_rtos_auto_j7_06_02_00_21/../qnx/qnx700/host/linux/x86_64/usr/bin
#######################################################################
TARGET_COMBO=J7:SYSBIOS:R5F:3:debug:TIARMCGT
HOST_ROOT=/home/a0487976/ti-j7-rtos/psdk_rtos_auto_j7_06_02_00_21/vision_apps
HOST_COMPILER=TIARMCGT
HOST_PLATFORM=PC
HOST_OS=LINUX
HOST_CPU=x86_64
HOST_ARCH=64
HOST_FAMILY=x86_64
HOST_NUM_CORES=1
TARGET_OS=SYSBIOS
TARGET_CPU=R5F
TARGET_ARCH=32
TARGET_FAMILY=ARM
TARGET_NUM_CORES=3
TARGET_PLATFORM=J7
TARGET_BUILD=debug
TARGET_OUT=/home/a0487976/ti-j7-rtos/psdk_rtos_auto_j7_06_02_00_21/vision_apps/out/J7/R5F/SYSBIOS/debug
TARGET_DOC=/home/a0487976/ti-j7-rtos/psdk_rtos_auto_j7_06_02_00_21/vision_apps/out/J7/R5F/SYSBIOS/debug/docs
BUILD_DEFS = CUSTOM_KERNEL_PATH BUILD_TUTORIAL BUILD_CONFORMANCE_TEST
J7_SYSBIOS_R5F_3_debug_TIARMCGT_DEFS = SYSBIOS J7 R5F="R5F" TARGET_NUM_CORES=3 TARGET_ARCH=32 ARCH_32 ARM TARGET_BUILD=2
J7_SYSBIOS_R5F_3_debug_TIARMCGT_LDIRS =
SCM_ROOT=
SCM_VERSION=
#######################################################################
TARGET_COMBO=J7:SYSBIOS:A72:1:debug:GCC_SYSBIOS_ARM
HOST_ROOT=/home/a0487976/ti-j7-rtos/psdk_rtos_auto_j7_06_02_00_21/vision_apps
HOST_COMPILER=GCC_SYSBIOS_ARM
HOST_PLATFORM=PC
HOST_OS=LINUX
HOST_CPU=x86_64
HOST_ARCH=64
HOST_FAMILY=x86_64
HOST_NUM_CORES=1
TARGET_OS=SYSBIOS
TARGET_CPU=A72
TARGET_ARCH=64
TARGET_FAMILY=ARM
TARGET_NUM_CORES=1
TARGET_PLATFORM=J7
TARGET_BUILD=debug
TARGET_OUT=/home/a0487976/ti-j7-rtos/psdk_rtos_auto_j7_06_02_00_21/vision_apps/out/J7/A72/SYSBIOS/debug
TARGET_DOC=/home/a0487976/ti-j7-rtos/psdk_rtos_auto_j7_06_02_00_21/vision_apps/out/J7/A72/SYSBIOS/debug/docs
BUILD_DEFS = CUSTOM_KERNEL_PATH BUILD_TUTORIAL BUILD_CONFORMANCE_TEST
J7_SYSBIOS_A72_1_debug_GCC_SYSBIOS_ARM_DEFS = SYSBIOS J7 A72="A72" TARGET_NUM_CORES=1 TARGET_ARCH=64 ARCH_64 ARM TARGET_BUILD=2
J7_SYSBIOS_A72_1_debug_GCC_SYSBIOS_ARM_LDIRS =
SCM_ROOT=
SCM_VERSION=
Build Skipped for kernels.stereo.target.bam.J7.SYSBIOS.A72.debug:vx_target_kernels_stereo_bam
#######################################################################
TARGET_COMBO=J7:SYSBIOS:C66:2:debug:CGT6X
HOST_ROOT=/home/a0487976/ti-j7-rtos/psdk_rtos_auto_j7_06_02_00_21/vision_apps
HOST_COMPILER=CGT6X
HOST_PLATFORM=PC
HOST_OS=LINUX
HOST_CPU=x86_64
HOST_ARCH=64
HOST_FAMILY=x86_64
HOST_NUM_CORES=1
TARGET_OS=SYSBIOS
TARGET_CPU=C66
TARGET_ARCH=32
TARGET_FAMILY=DSP
TARGET_NUM_CORES=2
TARGET_PLATFORM=J7
TARGET_BUILD=debug
TARGET_OUT=/home/a0487976/ti-j7-rtos/psdk_rtos_auto_j7_06_02_00_21/vision_apps/out/J7/C66/SYSBIOS/debug
TARGET_DOC=/home/a0487976/ti-j7-rtos/psdk_rtos_auto_j7_06_02_00_21/vision_apps/out/J7/C66/SYSBIOS/debug/docs
BUILD_DEFS = CUSTOM_KERNEL_PATH BUILD_TUTORIAL BUILD_CONFORMANCE_TEST
J7_SYSBIOS_C66_2_debug_CGT6X_DEFS = SYSBIOS J7 C66="C66" TARGET_NUM_CORES=2 TARGET_ARCH=32 ARCH_32 DSP TARGET_BUILD=2
J7_SYSBIOS_C66_2_debug_CGT6X_LDIRS =
SCM_ROOT=
SCM_VERSION=
Build Skipped for kernels.stereo.target.bam.J7.SYSBIOS.C66.debug:vx_target_kernels_stereo_bam
#######################################################################
TARGET_COMBO=J7:SYSBIOS:C71:1:debug:CGT7X
HOST_ROOT=/home/a0487976/ti-j7-rtos/psdk_rtos_auto_j7_06_02_00_21/vision_apps
HOST_COMPILER=CGT7X
HOST_PLATFORM=PC
HOST_OS=LINUX
HOST_CPU=x86_64
HOST_ARCH=64
HOST_FAMILY=x86_64
HOST_NUM_CORES=1
TARGET_OS=SYSBIOS
TARGET_CPU=C71
TARGET_ARCH=64
TARGET_FAMILY=DSP
TARGET_NUM_CORES=1
TARGET_PLATFORM=J7
TARGET_BUILD=debug
TARGET_OUT=/home/a0487976/ti-j7-rtos/psdk_rtos_auto_j7_06_02_00_21/vision_apps/out/J7/C71/SYSBIOS/debug
TARGET_DOC=/home/a0487976/ti-j7-rtos/psdk_rtos_auto_j7_06_02_00_21/vision_apps/out/J7/C71/SYSBIOS/debug/docs
BUILD_DEFS = CUSTOM_KERNEL_PATH BUILD_TUTORIAL BUILD_CONFORMANCE_TEST
J7_SYSBIOS_C71_1_debug_CGT7X_DEFS = SYSBIOS J7 C71="C71" TARGET_NUM_CORES=1 TARGET_ARCH=64 ARCH_64 DSP TARGET_BUILD=2
J7_SYSBIOS_C71_1_debug_CGT7X_LDIRS =
SCM_ROOT=
SCM_VERSION=
#######################################################################
TARGET_COMBO=J7:LINUX:A72:1:debug:GCC_LINUX_ARM
HOST_ROOT=/home/a0487976/ti-j7-rtos/psdk_rtos_auto_j7_06_02_00_21/vision_apps
HOST_COMPILER=GCC_LINUX_ARM
HOST_PLATFORM=PC
HOST_OS=LINUX
HOST_CPU=x86_64
HOST_ARCH=64
HOST_FAMILY=x86_64
HOST_NUM_CORES=1
TARGET_OS=LINUX
TARGET_CPU=A72
TARGET_ARCH=64
TARGET_FAMILY=ARM
TARGET_NUM_CORES=1
TARGET_PLATFORM=J7
TARGET_BUILD=debug
TARGET_OUT=/home/a0487976/ti-j7-rtos/psdk_rtos_auto_j7_06_02_00_21/vision_apps/out/J7/A72/LINUX/debug
TARGET_DOC=/home/a0487976/ti-j7-rtos/psdk_rtos_auto_j7_06_02_00_21/vision_apps/out/J7/A72/LINUX/debug/docs
BUILD_DEFS = CUSTOM_KERNEL_PATH BUILD_TUTORIAL BUILD_CONFORMANCE_TEST
J7_LINUX_A72_1_debug_GCC_LINUX_ARM_DEFS = LINUX J7 A72="A72" TARGET_NUM_CORES=1 TARGET_ARCH=64 ARCH_64 ARM TARGET_BUILD=2
J7_LINUX_A72_1_debug_GCC_LINUX_ARM_LDIRS =
SCM_ROOT=
SCM_VERSION=
Build Skipped for kernels.stereo.target.bam.J7.LINUX.A72.debug:vx_target_kernels_stereo_bam
#######################################################################
TARGET_COMBO=J7:SYSBIOS:R5F:3:release:TIARMCGT
HOST_ROOT=/home/a0487976/ti-j7-rtos/psdk_rtos_auto_j7_06_02_00_21/vision_apps
HOST_COMPILER=TIARMCGT
HOST_PLATFORM=PC
HOST_OS=LINUX
HOST_CPU=x86_64
HOST_ARCH=64
HOST_FAMILY=x86_64
HOST_NUM_CORES=1
TARGET_OS=SYSBIOS
TARGET_CPU=R5F
TARGET_ARCH=32
TARGET_FAMILY=ARM
TARGET_NUM_CORES=3
TARGET_PLATFORM=J7
TARGET_BUILD=release
TARGET_OUT=/home/a0487976/ti-j7-rtos/psdk_rtos_auto_j7_06_02_00_21/vision_apps/out/J7/R5F/SYSBIOS/release
TARGET_DOC=/home/a0487976/ti-j7-rtos/psdk_rtos_auto_j7_06_02_00_21/vision_apps/out/J7/R5F/SYSBIOS/release/docs
BUILD_DEFS = CUSTOM_KERNEL_PATH BUILD_TUTORIAL BUILD_CONFORMANCE_TEST
J7_SYSBIOS_R5F_3_release_TIARMCGT_DEFS = SYSBIOS J7 R5F="R5F" TARGET_NUM_CORES=3 TARGET_ARCH=32 ARCH_32 ARM TARGET_BUILD=1
J7_SYSBIOS_R5F_3_release_TIARMCGT_LDIRS =
SCM_ROOT=
SCM_VERSION=
#######################################################################
TARGET_COMBO=J7:SYSBIOS:A72:1:release:GCC_SYSBIOS_ARM
HOST_ROOT=/home/a0487976/ti-j7-rtos/psdk_rtos_auto_j7_06_02_00_21/vision_apps
HOST_COMPILER=GCC_SYSBIOS_ARM
HOST_PLATFORM=PC
HOST_OS=LINUX
HOST_CPU=x86_64
HOST_ARCH=64
HOST_FAMILY=x86_64
HOST_NUM_CORES=1
TARGET_OS=SYSBIOS
TARGET_CPU=A72
TARGET_ARCH=64
TARGET_FAMILY=ARM
TARGET_NUM_CORES=1
TARGET_PLATFORM=J7
TARGET_BUILD=release
TARGET_OUT=/home/a0487976/ti-j7-rtos/psdk_rtos_auto_j7_06_02_00_21/vision_apps/out/J7/A72/SYSBIOS/release
TARGET_DOC=/home/a0487976/ti-j7-rtos/psdk_rtos_auto_j7_06_02_00_21/vision_apps/out/J7/A72/SYSBIOS/release/docs
BUILD_DEFS = CUSTOM_KERNEL_PATH BUILD_TUTORIAL BUILD_CONFORMANCE_TEST
J7_SYSBIOS_A72_1_release_GCC_SYSBIOS_ARM_DEFS = SYSBIOS J7 A72="A72" TARGET_NUM_CORES=1 TARGET_ARCH=64 ARCH_64 ARM TARGET_BUILD=1
J7_SYSBIOS_A72_1_release_GCC_SYSBIOS_ARM_LDIRS =
SCM_ROOT=
SCM_VERSION=
Build Skipped for kernels.stereo.target.bam.J7.SYSBIOS.A72.release:vx_target_kernels_stereo_bam
#######################################################################
TARGET_COMBO=J7:SYSBIOS:C66:2:release:CGT6X
HOST_ROOT=/home/a0487976/ti-j7-rtos/psdk_rtos_auto_j7_06_02_00_21/vision_apps
HOST_COMPILER=CGT6X
HOST_PLATFORM=PC
HOST_OS=LINUX
HOST_CPU=x86_64
HOST_ARCH=64
HOST_FAMILY=x86_64
HOST_NUM_CORES=1
TARGET_OS=SYSBIOS
TARGET_CPU=C66
TARGET_ARCH=32
TARGET_FAMILY=DSP
TARGET_NUM_CORES=2
TARGET_PLATFORM=J7
TARGET_BUILD=release
TARGET_OUT=/home/a0487976/ti-j7-rtos/psdk_rtos_auto_j7_06_02_00_21/vision_apps/out/J7/C66/SYSBIOS/release
TARGET_DOC=/home/a0487976/ti-j7-rtos/psdk_rtos_auto_j7_06_02_00_21/vision_apps/out/J7/C66/SYSBIOS/release/docs
BUILD_DEFS = CUSTOM_KERNEL_PATH BUILD_TUTORIAL BUILD_CONFORMANCE_TEST
J7_SYSBIOS_C66_2_release_CGT6X_DEFS = SYSBIOS J7 C66="C66" TARGET_NUM_CORES=2 TARGET_ARCH=32 ARCH_32 DSP TARGET_BUILD=1
J7_SYSBIOS_C66_2_release_CGT6X_LDIRS =
SCM_ROOT=
SCM_VERSION=
Build Skipped for kernels.stereo.target.bam.J7.SYSBIOS.C66.release:vx_target_kernels_stereo_bam
#######################################################################
TARGET_COMBO=J7:SYSBIOS:C71:1:release:CGT7X
HOST_ROOT=/home/a0487976/ti-j7-rtos/psdk_rtos_auto_j7_06_02_00_21/vision_apps
HOST_COMPILER=CGT7X
HOST_PLATFORM=PC
HOST_OS=LINUX
HOST_CPU=x86_64
HOST_ARCH=64
HOST_FAMILY=x86_64
HOST_NUM_CORES=1
TARGET_OS=SYSBIOS
TARGET_CPU=C71
TARGET_ARCH=64
TARGET_FAMILY=DSP
TARGET_NUM_CORES=1
TARGET_PLATFORM=J7
TARGET_BUILD=release
TARGET_OUT=/home/a0487976/ti-j7-rtos/psdk_rtos_auto_j7_06_02_00_21/vision_apps/out/J7/C71/SYSBIOS/release
TARGET_DOC=/home/a0487976/ti-j7-rtos/psdk_rtos_auto_j7_06_02_00_21/vision_apps/out/J7/C71/SYSBIOS/release/docs
BUILD_DEFS = CUSTOM_KERNEL_PATH BUILD_TUTORIAL BUILD_CONFORMANCE_TEST
J7_SYSBIOS_C71_1_release_CGT7X_DEFS = SYSBIOS J7 C71="C71" TARGET_NUM_CORES=1 TARGET_ARCH=64 ARCH_64 DSP TARGET_BUILD=1
J7_SYSBIOS_C71_1_release_CGT7X_LDIRS =
SCM_ROOT=
SCM_VERSION=
#######################################################################
TARGET_COMBO=J7:LINUX:A72:1:release:GCC_LINUX_ARM
HOST_ROOT=/home/a0487976/ti-j7-rtos/psdk_rtos_auto_j7_06_02_00_21/vision_apps
HOST_COMPILER=GCC_LINUX_ARM
HOST_PLATFORM=PC
HOST_OS=LINUX
HOST_CPU=x86_64
HOST_ARCH=64
HOST_FAMILY=x86_64
HOST_NUM_CORES=1
TARGET_OS=LINUX
TARGET_CPU=A72
TARGET_ARCH=64
TARGET_FAMILY=ARM
TARGET_NUM_CORES=1
TARGET_PLATFORM=J7
TARGET_BUILD=release
TARGET_OUT=/home/a0487976/ti-j7-rtos/psdk_rtos_auto_j7_06_02_00_21/vision_apps/out/J7/A72/LINUX/release
TARGET_DOC=/home/a0487976/ti-j7-rtos/psdk_rtos_auto_j7_06_02_00_21/vision_apps/out/J7/A72/LINUX/release/docs
BUILD_DEFS = CUSTOM_KERNEL_PATH BUILD_TUTORIAL BUILD_CONFORMANCE_TEST
J7_LINUX_A72_1_release_GCC_LINUX_ARM_DEFS = LINUX J7 A72="A72" TARGET_NUM_CORES=1 TARGET_ARCH=64 ARCH_64 ARM TARGET_BUILD=1
J7_LINUX_A72_1_release_GCC_LINUX_ARM_LDIRS =
SCM_ROOT=
SCM_VERSION=
Build Skipped for kernels.stereo.target.bam.J7.LINUX.A72.release:vx_target_kernels_stereo_bam
#######################################################################
TARGET_COMBO=PC:LINUX:x86_64:1:debug:GCC_LINUX
HOST_ROOT=/home/a0487976/ti-j7-rtos/psdk_rtos_auto_j7_06_02_00_21/vision_apps
HOST_COMPILER=GCC_LINUX
HOST_PLATFORM=PC
HOST_OS=LINUX
HOST_CPU=x86_64
HOST_ARCH=64
HOST_FAMILY=x86_64
HOST_NUM_CORES=1
TARGET_OS=LINUX
TARGET_CPU=x86_64
TARGET_ARCH=64
TARGET_FAMILY=x86_64
TARGET_NUM_CORES=1
TARGET_PLATFORM=PC
TARGET_BUILD=debug
TARGET_OUT=/home/a0487976/ti-j7-rtos/psdk_rtos_auto_j7_06_02_00_21/vision_apps/out/PC/x86_64/LINUX/debug
TARGET_DOC=/home/a0487976/ti-j7-rtos/psdk_rtos_auto_j7_06_02_00_21/vision_apps/out/PC/x86_64/LINUX/debug/docs
BUILD_DEFS = CUSTOM_KERNEL_PATH BUILD_TUTORIAL BUILD_CONFORMANCE_TEST
PC_LINUX_x86_64_1_debug_GCC_LINUX_DEFS = LINUX PC x86_64="x86_64" TARGET_NUM_CORES=1 TARGET_ARCH=64 ARCH_64 TARGET_BUILD=2
PC_LINUX_x86_64_1_debug_GCC_LINUX_LDIRS =
SCM_ROOT=
SCM_VERSION=
Build Skipped for kernels.stereo.target.bam.PC.LINUX.x86_64.debug:vx_target_kernels_stereo_bam
#######################################################################
TARGET_COMBO=PC:LINUX:x86_64:1:release:GCC_LINUX
HOST_ROOT=/home/a0487976/ti-j7-rtos/psdk_rtos_auto_j7_06_02_00_21/vision_apps
HOST_COMPILER=GCC_LINUX
HOST_PLATFORM=PC
HOST_OS=LINUX
HOST_CPU=x86_64
HOST_ARCH=64
HOST_FAMILY=x86_64
HOST_NUM_CORES=1
TARGET_OS=LINUX
TARGET_CPU=x86_64
TARGET_ARCH=64
TARGET_FAMILY=x86_64
TARGET_NUM_CORES=1
TARGET_PLATFORM=PC
TARGET_BUILD=release
TARGET_OUT=/home/a0487976/ti-j7-rtos/psdk_rtos_auto_j7_06_02_00_21/vision_apps/out/PC/x86_64/LINUX/release
TARGET_DOC=/home/a0487976/ti-j7-rtos/psdk_rtos_auto_j7_06_02_00_21/vision_apps/out/PC/x86_64/LINUX/release/docs
BUILD_DEFS = CUSTOM_KERNEL_PATH BUILD_TUTORIAL BUILD_CONFORMANCE_TEST
PC_LINUX_x86_64_1_release_GCC_LINUX_DEFS = LINUX PC x86_64="x86_64" TARGET_NUM_CORES=1 TARGET_ARCH=64 ARCH_64 TARGET_BUILD=1
PC_LINUX_x86_64_1_release_GCC_LINUX_LDIRS =
SCM_ROOT=
SCM_VERSION=
Build Skipped for kernels.stereo.target.bam.PC.LINUX.x86_64.release:vx_target_kernels_stereo_bam
[TIARM] Compiling C app_run.c
[TIARM] Compiling C app_run_tirtos_test.c
[TIARM] Compiling C app_init.c
[TIARM] Compiling C app_mem_sysbios.c
Linking /home/a0487976/ti-j7-rtos/psdk_rtos_auto_j7_06_02_00_21/vision_apps/out/J7/R5F/SYSBIOS/debug/app_utils_mem.lib
==> new archive '/home/a0487976/ti-j7-rtos/psdk_rtos_auto_j7_06_02_00_21/vision_apps/out/J7/R5F/SYSBIOS/debug/app_utils_mem.lib'
==> building archive '/home/a0487976/ti-j7-rtos/psdk_rtos_auto_j7_06_02_00_21/vision_apps/out/J7/R5F/SYSBIOS/debug/app_utils_mem.lib'
[TIARM] Compiling C app_log_writer.c
[TIARM] Compiling C app_log_reader.c
[TIARM] Compiling C app_get.c
[TIARM] Compiling C app_log_sysbios.c
[TIARM] Compiling C app_cli_sysbios.c
[TIARM] Compiling C app_log_printf_ticgt_sysbios.c
Linking /home/a0487976/ti-j7-rtos/psdk_rtos_auto_j7_06_02_00_21/vision_apps/out/J7/R5F/SYSBIOS/debug/app_utils_console_io.lib
==> new archive '/home/a0487976/ti-j7-rtos/psdk_rtos_auto_j7_06_02_00_21/vision_apps/out/J7/R5F/SYSBIOS/debug/app_utils_console_io.lib'
==> building archive '/home/a0487976/ti-j7-rtos/psdk_rtos_auto_j7_06_02_00_21/vision_apps/out/J7/R5F/SYSBIOS/debug/app_utils_console_io.lib'
[TIARM] Compiling C app_ipc_sysbios.c
[TIARM] Compiling C app_ipc_sysbios_echo_test.c
Linking /home/a0487976/ti-j7-rtos/psdk_rtos_auto_j7_06_02_00_21/vision_apps/out/J7/R5F/SYSBIOS/debug/app_utils_ipc.lib
==> new archive '/home/a0487976/ti-j7-rtos/psdk_rtos_auto_j7_06_02_00_21/vision_apps/out/J7/R5F/SYSBIOS/debug/app_utils_ipc.lib'
==> building archive '/home/a0487976/ti-j7-rtos/psdk_rtos_auto_j7_06_02_00_21/vision_apps/out/J7/R5F/SYSBIOS/debug/app_utils_ipc.lib'
[TIARM] Compiling C app_remote_service_test.c
[TIARM] Compiling C app_remote_service.c
Linking /home/a0487976/ti-j7-rtos/psdk_rtos_auto_j7_06_02_00_21/vision_apps/out/J7/R5F/SYSBIOS/debug/app_utils_remote_service.lib
==> new archive '/home/a0487976/ti-j7-rtos/psdk_rtos_auto_j7_06_02_00_21/vision_apps/out/J7/R5F/SYSBIOS/debug/app_utils_remote_service.lib'
==> building archive '/home/a0487976/ti-j7-rtos/psdk_rtos_auto_j7_06_02_00_21/vision_apps/out/J7/R5F/SYSBIOS/debug/app_utils_remote_service.lib'
[TIARM] Compiling C app_udma.c
[TIARM] Compiling C app_udma_test.c
Linking /home/a0487976/ti-j7-rtos/psdk_rtos_auto_j7_06_02_00_21/vision_apps/out/J7/R5F/SYSBIOS/debug/app_utils_udma.lib
==> new archive '/home/a0487976/ti-j7-rtos/psdk_rtos_auto_j7_06_02_00_21/vision_apps/out/J7/R5F/SYSBIOS/debug/app_utils_udma.lib'
==> building archive '/home/a0487976/ti-j7-rtos/psdk_rtos_auto_j7_06_02_00_21/vision_apps/out/J7/R5F/SYSBIOS/debug/app_utils_udma.lib'
[TIARM] Compiling C app_sciclient.c
Linking /home/a0487976/ti-j7-rtos/psdk_rtos_auto_j7_06_02_00_21/vision_apps/out/J7/R5F/SYSBIOS/debug/app_utils_sciclient.lib
==> new archive '/home/a0487976/ti-j7-rtos/psdk_rtos_auto_j7_06_02_00_21/vision_apps/out/J7/R5F/SYSBIOS/debug/app_utils_sciclient.lib'
==> building archive '/home/a0487976/ti-j7-rtos/psdk_rtos_auto_j7_06_02_00_21/vision_apps/out/J7/R5F/SYSBIOS/debug/app_utils_sciclient.lib'
[TIARM] Compiling C app_cpu_hz.c
[TIARM] Compiling C app_r5f_init.c
[TIARM] Compiling C app_pinmux.c
Linking /home/a0487976/ti-j7-rtos/psdk_rtos_auto_j7_06_02_00_21/vision_apps/out/J7/R5F/SYSBIOS/debug/app_utils_misc.lib
==> new archive '/home/a0487976/ti-j7-rtos/psdk_rtos_auto_j7_06_02_00_21/vision_apps/out/J7/R5F/SYSBIOS/debug/app_utils_misc.lib'
==> building archive '/home/a0487976/ti-j7-rtos/psdk_rtos_auto_j7_06_02_00_21/vision_apps/out/J7/R5F/SYSBIOS/debug/app_utils_misc.lib'
[TIARM] Compiling C app_sensors.c
Linking /home/a0487976/ti-j7-rtos/psdk_rtos_auto_j7_06_02_00_21/vision_apps/out/J7/R5F/SYSBIOS/debug/app_utils_sensors.lib
==> new archive '/home/a0487976/ti-j7-rtos/psdk_rtos_auto_j7_06_02_00_21/vision_apps/out/J7/R5F/SYSBIOS/debug/app_utils_sensors.lib'
==> building archive '/home/a0487976/ti-j7-rtos/psdk_rtos_auto_j7_06_02_00_21/vision_apps/out/J7/R5F/SYSBIOS/debug/app_utils_sensors.lib'
[TIARM] Compiling C app_perf_stats_sysbios.c
[TIARM] Compiling C app_perf_stats_api.c
Linking /home/a0487976/ti-j7-rtos/psdk_rtos_auto_j7_06_02_00_21/vision_apps/out/J7/R5F/SYSBIOS/debug/app_utils_perf_stats.lib
==> new archive '/home/a0487976/ti-j7-rtos/psdk_rtos_auto_j7_06_02_00_21/vision_apps/out/J7/R5F/SYSBIOS/debug/app_utils_perf_stats.lib'
==> building archive '/home/a0487976/ti-j7-rtos/psdk_rtos_auto_j7_06_02_00_21/vision_apps/out/J7/R5F/SYSBIOS/debug/app_utils_perf_stats.lib'
[TIARM] Compiling C app_iss.c
Linking /home/a0487976/ti-j7-rtos/psdk_rtos_auto_j7_06_02_00_21/vision_apps/out/J7/R5F/SYSBIOS/debug/app_utils_iss.lib
==> new archive '/home/a0487976/ti-j7-rtos/psdk_rtos_auto_j7_06_02_00_21/vision_apps/out/J7/R5F/SYSBIOS/debug/app_utils_iss.lib'
==> building archive '/home/a0487976/ti-j7-rtos/psdk_rtos_auto_j7_06_02_00_21/vision_apps/out/J7/R5F/SYSBIOS/debug/app_utils_iss.lib'
[TIARM] Compiling C draw2d_ti_logo_01.c
[TIARM] Compiling C draw2d_font12_yuv.c
[TIARM] Compiling C draw2d_ti_logo_03.c
[TIARM] Compiling C draw2d_font10_yuv.c
[TIARM] Compiling C draw2d_dof_colourmap.c
[TIARM] Compiling C draw2d_font03.c
[TIARM] Compiling C draw2d_sde_colourmap.c
[TIARM] Compiling C draw2d_ti_logo_02.c
[TIARM] Compiling C draw2d_font_bmp.c
[TIARM] Compiling C draw2d.c
[TIARM] Compiling C draw2d_ti_logo_00.c
[TIARM] Compiling C draw2d_ti_logo_05.c
[TIARM] Compiling C draw2d_font01.c
[TIARM] Compiling C draw2d_font13_yuv.c
[TIARM] Compiling C draw2d_font02.c
[TIARM] Compiling C draw2d_ti_logo_04.c
[TIARM] Compiling C draw2d_font11_yuv.c
[TIARM] Compiling C draw2d_font00.c
Linking /home/a0487976/ti-j7-rtos/psdk_rtos_auto_j7_06_02_00_21/vision_apps/out/J7/R5F/SYSBIOS/debug/app_utils_draw2d.lib
==> new archive '/home/a0487976/ti-j7-rtos/psdk_rtos_auto_j7_06_02_00_21/vision_apps/out/J7/R5F/SYSBIOS/debug/app_utils_draw2d.lib'
==> building archive '/home/a0487976/ti-j7-rtos/psdk_rtos_auto_j7_06_02_00_21/vision_apps/out/J7/R5F/SYSBIOS/debug/app_utils_draw2d.lib'
[TIARM] Compiling C app_pcie_queue.c
Linking /home/a0487976/ti-j7-rtos/psdk_rtos_auto_j7_06_02_00_21/vision_apps/out/J7/R5F/SYSBIOS/debug/app_utils_pcie_queue.lib
==> new archive '/home/a0487976/ti-j7-rtos/psdk_rtos_auto_j7_06_02_00_21/vision_apps/out/J7/R5F/SYSBIOS/debug/app_utils_pcie_queue.lib'
==> building archive '/home/a0487976/ti-j7-rtos/psdk_rtos_auto_j7_06_02_00_21/vision_apps/out/J7/R5F/SYSBIOS/debug/app_utils_pcie_queue.lib'
[TIARM] Compiling C vx_kernels_img_proc_target.c
[TIARM] Compiling C vx_img_mosaic_msc_target.c
[TIARM] Compiling C vx_img_mosaic_draw_overlay_avp2.c
Linking /home/a0487976/ti-j7-rtos/psdk_rtos_auto_j7_06_02_00_21/vision_apps/out/J7/R5F/SYSBIOS/debug/vx_target_kernels_img_proc_r5f.lib
==> new archive '/home/a0487976/ti-j7-rtos/psdk_rtos_auto_j7_06_02_00_21/vision_apps/out/J7/R5F/SYSBIOS/debug/vx_target_kernels_img_proc_r5f.lib'
==> building archive '/home/a0487976/ti-j7-rtos/psdk_rtos_auto_j7_06_02_00_21/vision_apps/out/J7/R5F/SYSBIOS/debug/vx_target_kernels_img_proc_r5f.lib'
Linking /home/a0487976/ti-j7-rtos/psdk_rtos_auto_j7_06_02_00_21/vision_apps/out/J7/R5F/SYSBIOS/debug/app_tirtos_common_mcu2_0.lib
==> new archive '/home/a0487976/ti-j7-rtos/psdk_rtos_auto_j7_06_02_00_21/vision_apps/out/J7/R5F/SYSBIOS/debug/app_tirtos_common_mcu2_0.lib'
==> building archive '/home/a0487976/ti-j7-rtos/psdk_rtos_auto_j7_06_02_00_21/vision_apps/out/J7/R5F/SYSBIOS/debug/app_tirtos_common_mcu2_0.lib'
Building app_tirtos_common_mcu2_0.lib as static library
[TIARM] Compiling C app_run.c
[TIARM] Compiling C app_run_tirtos_test.c
[TIARM] Compiling C app_init.c
Linking /home/a0487976/ti-j7-rtos/psdk_rtos_auto_j7_06_02_00_21/vision_apps/out/J7/R5F/SYSBIOS/debug/app_tirtos_common_mcu2_1.lib
==> new archive '/home/a0487976/ti-j7-rtos/psdk_rtos_auto_j7_06_02_00_21/vision_apps/out/J7/R5F/SYSBIOS/debug/app_tirtos_common_mcu2_1.lib'
==> building archive '/home/a0487976/ti-j7-rtos/psdk_rtos_auto_j7_06_02_00_21/vision_apps/out/J7/R5F/SYSBIOS/debug/app_tirtos_common_mcu2_1.lib'
Building app_tirtos_common_mcu2_1.lib as static library
[TIARM] Compiling C main.c
Running xdc configuro for apps.basic_demos.app_tirtos.tirtos_linux.mcu2_0
making package.mak (because of package.bld) ...
generating interfaces for package configuro (because package/package.xdc.inc is older than package.xdc) ...
configuring mcu2_0.xer5f from package/cfg/mcu2_0_per5f.cfg ...
# !!! Clock TimerId [0] @ 0x24c0000 and interrupt 168 !!!
# MPU setup for 12 entries !!!
generating custom ti.sysbios library makefile ...
Starting build of library sources ...
making /home/a0487976/ti-j7-rtos/psdk_rtos_auto_j7_06_02_00_21/vision_apps/out/J7/R5F/SYSBIOS/debug/module/apps.basic_demos.app_tirtos.tirtos_linux.mcu2_0/configuro/package/cfg/mcu2_0_per5f.src/sysbios/sysbios.aer5f ...
cler5f /home/a0487976/ti-j7-rtos/psdk_rtos_auto_j7_06_02_00_21/bios_6_76_03_01/packages/ti/sysbios/BIOS.c ...
asmer5f /home/a0487976/ti-j7-rtos/psdk_rtos_auto_j7_06_02_00_21/bios_6_76_03_01/packages/ti/sysbios/family/arm/IntrinsicsSupport_asm.asm ...
asmer5f /home/a0487976/ti-j7-rtos/psdk_rtos_auto_j7_06_02_00_21/bios_6_76_03_01/packages/ti/sysbios/family/arm/MPU_asm.sv7R ...
asmer5f /home/a0487976/ti-j7-rtos/psdk_rtos_auto_j7_06_02_00_21/bios_6_76_03_01/packages/ti/sysbios/family/arm/TaskSupport_asm.asm ...
asmer5f /home/a0487976/ti-j7-rtos/psdk_rtos_auto_j7_06_02_00_21/bios_6_76_03_01/packages/ti/sysbios/timers/dmtimer/Timer_asm.s470 ...
asmer5f /home/a0487976/ti-j7-rtos/psdk_rtos_auto_j7_06_02_00_21/bios_6_76_03_01/packages/ti/sysbios/family/arm/v7r/keystone3/Core_asm.sv7R ...
asmer5f /home/a0487976/ti-j7-rtos/psdk_rtos_auto_j7_06_02_00_21/bios_6_76_03_01/packages/ti/sysbios/family/arm/v7r/keystone3/Hwi_asm.sv7R ...
asmer5f /home/a0487976/ti-j7-rtos/psdk_rtos_auto_j7_06_02_00_21/bios_6_76_03_01/packages/ti/sysbios/family/arm/v7r/keystone3/Hwi_asm_switch.sv7R ...
asmer5f /home/a0487976/ti-j7-rtos/psdk_rtos_auto_j7_06_02_00_21/bios_6_76_03_01/packages/ti/sysbios/family/arm/exc/Exception_asm.asm ...
asmer5f /home/a0487976/ti-j7-rtos/psdk_rtos_auto_j7_06_02_00_21/bios_6_76_03_01/packages/ti/sysbios/family/arm/v7r/Cache_asm.sv7R ...
asmer5f /home/a0487976/ti-j7-rtos/psdk_rtos_auto_j7_06_02_00_21/bios_6_76_03_01/packages/ti/sysbios/family/arm/a15/TimestampProvider_asm.asm ...
arer5f BIOS.obj arm_IntrinsicsSupport_asm.obj arm_MPU_asm.obj arm_TaskSupport_asm.obj dmtimer_Timer_asm.obj keystone3_Core_asm.obj keystone3_Hwi_asm.obj keystone3_Hwi_asm_switch.obj exc_Exception_asm.obj v7r_Cache_asm.obj a15_TimestampProvider_asm.obj ...
Build of libraries done.
cler5f package/cfg/mcu2_0_per5f.c ...
Linking /home/a0487976/ti-j7-rtos/psdk_rtos_auto_j7_06_02_00_21/vision_apps/out/J7/R5F/SYSBIOS/debug/vx_app_tirtos_linux_mcu2_0.out
Building vx_app_tirtos_linux_mcu2_0.out as static library
[TIARM] Compiling C main.c
[TIARM] Compiling C app_hwa.c
Linking /home/a0487976/ti-j7-rtos/psdk_rtos_auto_j7_06_02_00_21/vision_apps/out/J7/R5F/SYSBIOS/debug/app_utils_hwa.lib
==> new archive '/home/a0487976/ti-j7-rtos/psdk_rtos_auto_j7_06_02_00_21/vision_apps/out/J7/R5F/SYSBIOS/debug/app_utils_hwa.lib'
==> building archive '/home/a0487976/ti-j7-rtos/psdk_rtos_auto_j7_06_02_00_21/vision_apps/out/J7/R5F/SYSBIOS/debug/app_utils_hwa.lib'
[TIARM] Compiling C app_dss.c
[TIARM] Compiling C app_dss_j721e.c
[TIARM] Compiling C app_dctrl.c
[TIARM] Compiling C app_dss_defaults.c
[TIARM] Compiling C app_dss_dual_display_defaults.c
Linking /home/a0487976/ti-j7-rtos/psdk_rtos_auto_j7_06_02_00_21/vision_apps/out/J7/R5F/SYSBIOS/debug/app_utils_dss.lib
==> new archive '/home/a0487976/ti-j7-rtos/psdk_rtos_auto_j7_06_02_00_21/vision_apps/out/J7/R5F/SYSBIOS/debug/app_utils_dss.lib'
==> building archive '/home/a0487976/ti-j7-rtos/psdk_rtos_auto_j7_06_02_00_21/vision_apps/out/J7/R5F/SYSBIOS/debug/app_utils_dss.lib'
[TIARM] Compiling C vx_pcie_rx_target.c
[TIARM] Compiling C vx_pcie_tx_target.c
[TIARM] Compiling C vx_kernels_sample_target.c
Linking /home/a0487976/ti-j7-rtos/psdk_rtos_auto_j7_06_02_00_21/vision_apps/out/J7/R5F/SYSBIOS/debug/vx_target_kernels_sample_r5f.lib
==> new archive '/home/a0487976/ti-j7-rtos/psdk_rtos_auto_j7_06_02_00_21/vision_apps/out/J7/R5F/SYSBIOS/debug/vx_target_kernels_sample_r5f.lib'
==> building archive '/home/a0487976/ti-j7-rtos/psdk_rtos_auto_j7_06_02_00_21/vision_apps/out/J7/R5F/SYSBIOS/debug/vx_target_kernels_sample_r5f.lib'
Running xdc configuro for apps.basic_demos.app_tirtos.tirtos_linux.mcu2_1
making package.mak (because of package.bld) ...
generating interfaces for package configuro (because package/package.xdc.inc is older than package.xdc) ...
configuring mcu2_1.xer5f from package/cfg/mcu2_1_per5f.cfg ...
# !!! Clock TimerId [0] @ 0x24c0000 and interrupt 168 !!!
# MPU setup for 16 entries !!!
generating custom ti.sysbios library makefile ...
Starting build of library sources ...
making /home/a0487976/ti-j7-rtos/psdk_rtos_auto_j7_06_02_00_21/vision_apps/out/J7/R5F/SYSBIOS/debug/module/apps.basic_demos.app_tirtos.tirtos_linux.mcu2_1/configuro/package/cfg/mcu2_1_per5f.src/sysbios/sysbios.aer5f ...
cler5f /home/a0487976/ti-j7-rtos/psdk_rtos_auto_j7_06_02_00_21/bios_6_76_03_01/packages/ti/sysbios/BIOS.c ...
asmer5f /home/a0487976/ti-j7-rtos/psdk_rtos_auto_j7_06_02_00_21/bios_6_76_03_01/packages/ti/sysbios/family/arm/IntrinsicsSupport_asm.asm ...
asmer5f /home/a0487976/ti-j7-rtos/psdk_rtos_auto_j7_06_02_00_21/bios_6_76_03_01/packages/ti/sysbios/family/arm/MPU_asm.sv7R ...
asmer5f /home/a0487976/ti-j7-rtos/psdk_rtos_auto_j7_06_02_00_21/bios_6_76_03_01/packages/ti/sysbios/family/arm/TaskSupport_asm.asm ...
asmer5f /home/a0487976/ti-j7-rtos/psdk_rtos_auto_j7_06_02_00_21/bios_6_76_03_01/packages/ti/sysbios/timers/dmtimer/Timer_asm.s470 ...
asmer5f /home/a0487976/ti-j7-rtos/psdk_rtos_auto_j7_06_02_00_21/bios_6_76_03_01/packages/ti/sysbios/family/arm/v7r/keystone3/Core_asm.sv7R ...
asmer5f /home/a0487976/ti-j7-rtos/psdk_rtos_auto_j7_06_02_00_21/bios_6_76_03_01/packages/ti/sysbios/family/arm/v7r/keystone3/Hwi_asm.sv7R ...
asmer5f /home/a0487976/ti-j7-rtos/psdk_rtos_auto_j7_06_02_00_21/bios_6_76_03_01/packages/ti/sysbios/family/arm/v7r/keystone3/Hwi_asm_switch.sv7R ...
asmer5f /home/a0487976/ti-j7-rtos/psdk_rtos_auto_j7_06_02_00_21/bios_6_76_03_01/packages/ti/sysbios/family/arm/exc/Exception_asm.asm ...
asmer5f /home/a0487976/ti-j7-rtos/psdk_rtos_auto_j7_06_02_00_21/bios_6_76_03_01/packages/ti/sysbios/family/arm/v7r/Cache_asm.sv7R ...
asmer5f /home/a0487976/ti-j7-rtos/psdk_rtos_auto_j7_06_02_00_21/bios_6_76_03_01/packages/ti/sysbios/family/arm/a15/TimestampProvider_asm.asm ...
arer5f BIOS.obj arm_IntrinsicsSupport_asm.obj arm_MPU_asm.obj arm_TaskSupport_asm.obj dmtimer_Timer_asm.obj keystone3_Core_asm.obj keystone3_Hwi_asm.obj keystone3_Hwi_asm_switch.obj exc_Exception_asm.obj v7r_Cache_asm.obj a15_TimestampProvider_asm.obj ...
Build of libraries done.
cler5f package/cfg/mcu2_1_per5f.c ...
Linking /home/a0487976/ti-j7-rtos/psdk_rtos_auto_j7_06_02_00_21/vision_apps/out/J7/R5F/SYSBIOS/debug/vx_app_tirtos_linux_mcu2_1.out
Building vx_app_tirtos_linux_mcu2_1.out as static library
[TIARM] Compiling C main_tirtos.c
[TIARM] Compiling C app_dss.c
[TIARM] Compiling C app_udma_memcpy.c
[TIARM] Compiling C app_CAN_reader.c
[TIARM] Compiling C app_mcan.c
Required system library lib_remote_device.lib
Required system library lib_remote_device_display.lib
Running xdc configuro for apps.cockpit_demos.app_tirtos_linux
making package.mak (because of package.bld) ...
generating interfaces for package configuro (because package/package.xdc.inc is older than package.xdc) ...
configuring mcu2_1.xer5f from package/cfg/mcu2_1_per5f.cfg ...
generating custom ti.sysbios library makefile ...
Starting build of library sources ...
making /home/a0487976/ti-j7-rtos/psdk_rtos_auto_j7_06_02_00_21/vision_apps/out/J7/R5F/SYSBIOS/debug/module/apps.cockpit_demos.app_tirtos_linux/configuro/package/cfg/mcu2_1_per5f.src/sysbios/sysbios.aer5f ...
cler5f /home/a0487976/ti-j7-rtos/psdk_rtos_auto_j7_06_02_00_21/bios_6_76_03_01/packages/ti/sysbios/BIOS.c ...
asmer5f /home/a0487976/ti-j7-rtos/psdk_rtos_auto_j7_06_02_00_21/bios_6_76_03_01/packages/ti/sysbios/family/arm/IntrinsicsSupport_asm.asm ...
asmer5f /home/a0487976/ti-j7-rtos/psdk_rtos_auto_j7_06_02_00_21/bios_6_76_03_01/packages/ti/sysbios/family/arm/MPU_asm.sv7R ...
asmer5f /home/a0487976/ti-j7-rtos/psdk_rtos_auto_j7_06_02_00_21/bios_6_76_03_01/packages/ti/sysbios/family/arm/TaskSupport_asm.asm ...
asmer5f /home/a0487976/ti-j7-rtos/psdk_rtos_auto_j7_06_02_00_21/bios_6_76_03_01/packages/ti/sysbios/family/arm/v7r/keystone3/Core_asm.sv7R ...
asmer5f /home/a0487976/ti-j7-rtos/psdk_rtos_auto_j7_06_02_00_21/bios_6_76_03_01/packages/ti/sysbios/family/arm/v7r/keystone3/Hwi_asm.sv7R ...
asmer5f /home/a0487976/ti-j7-rtos/psdk_rtos_auto_j7_06_02_00_21/bios_6_76_03_01/packages/ti/sysbios/family/arm/v7r/keystone3/Hwi_asm_switch.sv7R ...
asmer5f /home/a0487976/ti-j7-rtos/psdk_rtos_auto_j7_06_02_00_21/bios_6_76_03_01/packages/ti/sysbios/family/arm/exc/Exception_asm.asm ...
asmer5f /home/a0487976/ti-j7-rtos/psdk_rtos_auto_j7_06_02_00_21/bios_6_76_03_01/packages/ti/sysbios/family/arm/v7r/Cache_asm.sv7R ...
asmer5f /home/a0487976/ti-j7-rtos/psdk_rtos_auto_j7_06_02_00_21/bios_6_76_03_01/packages/ti/sysbios/timers/dmtimer/Timer_asm.s470 ...
asmer5f /home/a0487976/ti-j7-rtos/psdk_rtos_auto_j7_06_02_00_21/bios_6_76_03_01/packages/ti/sysbios/family/arm/a15/TimestampProvider_asm.asm ...
arer5f BIOS.obj arm_IntrinsicsSupport_asm.obj arm_MPU_asm.obj arm_TaskSupport_asm.obj keystone3_Core_asm.obj keystone3_Hwi_asm.obj keystone3_Hwi_asm_switch.obj exc_Exception_asm.obj v7r_Cache_asm.obj dmtimer_Timer_asm.obj a15_TimestampProvider_asm.obj ...
Build of libraries done.
cler5f package/cfg/mcu2_1_per5f.c ...
Linking /home/a0487976/ti-j7-rtos/psdk_rtos_auto_j7_06_02_00_21/vision_apps/out/J7/R5F/SYSBIOS/debug/cockpit_app_cockpit_can_params_demo.out
Building cockpit_app_cockpit_can_params_demo.out as static library
[TIARM] Compiling C vx_ptk_alg_common.c
Linking /home/a0487976/ti-j7-rtos/psdk_rtos_auto_j7_06_02_00_21/vision_apps/out/J7/R5F/SYSBIOS/debug/vx_kernels_common.lib
==> new archive '/home/a0487976/ti-j7-rtos/psdk_rtos_auto_j7_06_02_00_21/vision_apps/out/J7/R5F/SYSBIOS/debug/vx_kernels_common.lib'
==> building archive '/home/a0487976/ti-j7-rtos/psdk_rtos_auto_j7_06_02_00_21/vision_apps/out/J7/R5F/SYSBIOS/debug/vx_kernels_common.lib'
Building vx_kernels_common.lib as static library
Building vx_target_kernels_img_proc_r5f.lib as static library
[TIARM] Compiling C tivx_lidar_node_api.c
[TIARM] Compiling C vx_kernels_lidar_host.c
[TIARM] Compiling C vx_lidar_mdc_host.c
[TIARM] Compiling C vx_lidar_gpc_host.c
Linking /home/a0487976/ti-j7-rtos/psdk_rtos_auto_j7_06_02_00_21/vision_apps/out/J7/R5F/SYSBIOS/debug/vx_kernels_lidar.lib
==> new archive '/home/a0487976/ti-j7-rtos/psdk_rtos_auto_j7_06_02_00_21/vision_apps/out/J7/R5F/SYSBIOS/debug/vx_kernels_lidar.lib'
==> building archive '/home/a0487976/ti-j7-rtos/psdk_rtos_auto_j7_06_02_00_21/vision_apps/out/J7/R5F/SYSBIOS/debug/vx_kernels_lidar.lib'
Building vx_kernels_lidar.lib as static library
Building vx_target_kernels_sample_r5f.lib as static library
Linking /home/a0487976/ti-j7-rtos/psdk_rtos_auto_j7_06_02_00_21/vision_apps/out/J7/R5F/SYSBIOS/debug/vx_kernels_stereo_tests.lib
==> building archive '/home/a0487976/ti-j7-rtos/psdk_rtos_auto_j7_06_02_00_21/vision_apps/out/J7/R5F/SYSBIOS/debug/vx_kernels_stereo_tests.lib'
Building vx_kernels_stereo_tests.lib as static library
Building app_utils_console_io.lib as static library
Building app_utils_draw2d.lib as static library
Building app_utils_dss.lib as static library
Building app_utils_hwa.lib as static library
Building app_utils_ipc.lib as static library
Building app_utils_iss.lib as static library
Building app_utils_mem.lib as static library
Building app_utils_misc.lib as static library
Building app_utils_pcie_queue.lib as static library
Building app_utils_perf_stats.lib as static library
Building app_utils_remote_service.lib as static library
Building app_utils_sciclient.lib as static library
Building app_utils_sensors.lib as static library
Building app_utils_udma.lib as static library
[GCC] Compiling C99 srv_bowl_lut_gen_applib.c
Linking /home/a0487976/ti-j7-rtos/psdk_rtos_auto_j7_06_02_00_21/vision_apps/out/J7/A72/SYSBIOS/debug/libvx_applib_srv_bowl_lut_gen.a
[GCC] Compiling C99 srv_calibration_applib.c
Linking /home/a0487976/ti-j7-rtos/psdk_rtos_auto_j7_06_02_00_21/vision_apps/out/J7/A72/SYSBIOS/debug/libvx_applib_srv_calibration.a
Linking /home/a0487976/ti-j7-rtos/psdk_rtos_auto_j7_06_02_00_21/vision_apps/out/J7/A72/SYSBIOS/debug/libvx_applib_tests.a
[GCC] Compiling C99 main.c
[GCC] Compiling C99 app_c7x_kernel_img_add.c
Linking /home/a0487976/ti-j7-rtos/psdk_rtos_auto_j7_06_02_00_21/vision_apps/out/J7/A72/SYSBIOS/debug/libvx_app_c7x_kernel.a
[GCC] Compiling C99 main.c
[GCC] Compiling C99 dof_pyramid_module.c
[GCC] Compiling C99 dof_proc_module.c
[GCC] Compiling C99 dof_viz_module.c
[GCC] Compiling C99 dof_display_module.c
Linking /home/a0487976/ti-j7-rtos/psdk_rtos_auto_j7_06_02_00_21/vision_apps/out/J7/A72/SYSBIOS/debug/libvx_app_dense_optical_flow.a
[GCC] Compiling C99 main.c
[GCC] Compiling C99 dof_pyramid_module.c
[GCC] Compiling C99 dof_proc_module.c
[GCC] Compiling C99 dof_viz_module.c
[GCC] Compiling C99 dof_display_module.c
[GCC] Compiling C99 dof_img_mosaic_module.c
Linking /home/a0487976/ti-j7-rtos/psdk_rtos_auto_j7_06_02_00_21/vision_apps/out/J7/A72/SYSBIOS/debug/libvx_app_dense_optical_flow2.a
[GCC] Compiling C99 app_single_cam_main.c
Linking /home/a0487976/ti-j7-rtos/psdk_rtos_auto_j7_06_02_00_21/vision_apps/out/J7/A72/SYSBIOS/debug/libvx_app_single_cam.a
[GCC] Compiling C99 main.c
Linking /home/a0487976/ti-j7-rtos/psdk_rtos_auto_j7_06_02_00_21/vision_apps/out/J7/A72/SYSBIOS/debug/libvx_app_stereo_depth.a
[GCC] Compiling C99 main.c
Linking /home/a0487976/ti-j7-rtos/psdk_rtos_auto_j7_06_02_00_21/vision_apps/out/J7/A72/SYSBIOS/debug/libvx_app_test_framework.a
[GCC] Compiling C99 app_run.c
[GCC] Compiling C99 app_run_tirtos_test.c
[GCC] Compiling C99 app_init.c
[GCC] Compiling C99 app_mem_sysbios.c
Linking /home/a0487976/ti-j7-rtos/psdk_rtos_auto_j7_06_02_00_21/vision_apps/out/J7/A72/SYSBIOS/debug/libapp_utils_mem.a
[C6X] Compiling C app_mem_sysbios.c
Linking /home/a0487976/ti-j7-rtos/psdk_rtos_auto_j7_06_02_00_21/vision_apps/out/J7/C66/SYSBIOS/debug/app_utils_mem.lib
==> new archive '/home/a0487976/ti-j7-rtos/psdk_rtos_auto_j7_06_02_00_21/vision_apps/out/J7/C66/SYSBIOS/debug/app_utils_mem.lib'
==> building archive '/home/a0487976/ti-j7-rtos/psdk_rtos_auto_j7_06_02_00_21/vision_apps/out/J7/C66/SYSBIOS/debug/app_utils_mem.lib'
[C7X] Compiling C app_mem_sysbios.c
Linking /home/a0487976/ti-j7-rtos/psdk_rtos_auto_j7_06_02_00_21/vision_apps/out/J7/C71/SYSBIOS/debug/app_utils_mem.lib
==> new archive '/home/a0487976/ti-j7-rtos/psdk_rtos_auto_j7_06_02_00_21/vision_apps/out/J7/C71/SYSBIOS/debug/app_utils_mem.lib'
==> building archive '/home/a0487976/ti-j7-rtos/psdk_rtos_auto_j7_06_02_00_21/vision_apps/out/J7/C71/SYSBIOS/debug/app_utils_mem.lib'
[GCC] Compiling C99 app_mem_linux_ion.c
/home/a0487976/ti-j7-rtos/psdk_rtos_auto_j7_06_02_00_21/vision_apps/utils/mem/src/app_mem_linux_ion.c:76:10: fatal error: ion/ion.h: No such file or directory
#include <ion/ion.h>
^~~~~~~~~~~
compilation terminated.
concerto/finale.mak:306: recipe for target '/home/a0487976/ti-j7-rtos/psdk_rtos_auto_j7_06_02_00_21/vision_apps/out/J7/A72/LINUX/debug/module/utils.mem.src/app_mem_linux_ion.o' failed
make[1]: *** [/home/a0487976/ti-j7-rtos/psdk_rtos_auto_j7_06_02_00_21/vision_apps/out/J7/A72/LINUX/debug/module/utils.mem.src/app_mem_linux_ion.o] Error 1
make[1]: Leaving directory '/home/a0487976/ti-j7-rtos/psdk_rtos_auto_j7_06_02_00_21/vision_apps'
Makefile:159: recipe for target 'vision_apps' failed
make: *** [vision_apps] Error 2
Hello Brahim,
Please be sure to go through all the steps below in the section on "Build and Run" in the user guide, namely "Build Environment Setup" -> "Build Instructions" -> "Run Instructions". It looks like a few steps have not been done.
For instance, it looks like Step 2 on this page has not been completed. Specifically, this step is to download the PSDKLA and copy to your working directory. The PSDKLA has the ion header file.
Also, the "make vision_apps" step is shown in "Build Instructions" step below:
Regards,
Lucas
Hi Lucas,
I redid the steps from the beginning but still have problems, specifically in "Run instructions" step 1 to run psdk_rtos_auto/scripts/install_to_sd_card.sh
It shows this error (Hundreds of line of errors like input/output error and permission denied)
I also have a SD card where vision_apps package is already installed but still need to copy test_data file into it, I run the command in step 2 but I have this error agaaaaaaain
Please check what the problem is !
Thanks,
Brahim
Hello Brahim,
It looks like the permissions did not get set properly with the partitioning of the SD card. Did you use Option 1 or Option 2 from the step below for partitioning the SD card? Could you try running the script from Option 1 again before installing and send me the output of this?
Regards,
Lucas
Hello Brahim,
If you run the psdk_rtos_auto/scripts/install_to_sd_card.sh now, do you still see the same errors?
If so, this may be a permissions issue related to your SD card or settings in your environment. Could you send me the permissions of the SD card by running "ls -l /media/<user>"?
Regards,
Lucas
Hi Brahim,
The permissions of your SD card appear correct.
Can you re-download the 6.02 PSDKLA and re-copy the tisdk-rootfs-image-j7-evm.tar.xz to your ~/psdk_rtos_auto_j7_06_02_00_21 folder and try installing again? It looks like the possibly the permissions of the tarred file system could be incorrect.
Regards,
Lucas
Hello Brahim,
Can you try running "sudo chmod 777 -R /media/<user>/rootfs/opt/vision_apps/" and trying again? If you still see the same issue, you could try extracting the tar file locally and then copying the extracted folder onto the SD card.
Regards,
Lucas
Hi Lucas,
I tried with chmod command but it doesn't work. I also tried cp command by extracting files locally and copying them onto the sd card but it has the same problem (read-only file system), I also tried to remount the rootfs partition in read-write mode but it doesn't work.
When I run the command tar --strip-components=1 -xf ${PSDKRA_PATH}/psdk_rtos_auto_ti_data_set_06_02_00.tar.gz or the cp command, It doesn't show the error directly, it works a little bit and copies more than 300 files and then it stops and show that error.
It's been a week that I'm trying with this.
Regards,
Brahim
Hi Brahim,
Per our discussion over email, we will take this offline and post the results here.
Regards,
Lucas