This thread has been locked.

If you have a related question, please click the "Ask a related question" button in the top right corner. The newly created question will be automatically linked to this question.

TMDSICE3359: No rule to make target

Part Number: TMDSICE3359
Other Parts Discussed in Thread: TLK110, SYSBIOS

OK,

selecting "this resolved my issues" closes the thread...

And yes, my original issue was resolved, but that resultet in related issue:

After following the steps you described, only one warning message was left:

Still, I could import the project. However, trying to build it through the following errors:

**** Build of configuration AM335x_debug for project ethercat_slave_demo_AM335x_arm ****

"C:\\ti\\ccs1011\\ccs\\utils\\bin\\gmake" -k -j 8 all -O

subdir_rules.mk:37: recipe for target 'build-445097391' failed
gmake: *** No rule to make target 'C:/ti/PRU-ICSS-EtherCAT_Slave_01.00.07.02/protocols/ethercat_slave/ecat_appl/am335x_app.cfg', needed by 'configPkg/linker.cmd'.
gmake: *** No rule to make target 'C:/ti/PRU-ICSS-EtherCAT_Slave_01.00.07.02/examples/board/iceAM335x/board_gpioLed.c', needed by 'board_gpioLed.o'.
gmake: *** No rule to make target 'C:/ti/PRU-ICSS-EtherCAT_Slave_01.00.07.02/examples/board/iceAM335x/board_i2cLed.c', needed by 'board_i2cLed.o'.
gmake: *** No rule to make target 'C:/ti/PRU-ICSS-EtherCAT_Slave_01.00.07.02/examples/board/iceAM335x/board_mcspi.c', needed by 'board_mcspi.o'.
gmake: *** No rule to make target 'C:/ti/PRU-ICSS-EtherCAT_Slave_01.00.07.02/examples/board/common/board_misc.c', needed by 'board_misc.o'.
gmake: *** No rule to make target 'C:/ti/PRU-ICSS-EtherCAT_Slave_01.00.07.02/examples/board/iceAM335x/board_oled.c', needed by 'board_oled.o'.
gmake: *** No rule to make target 'C:/ti/PRU-ICSS-EtherCAT_Slave_01.00.07.02/examples/board/iceAM335x/board_phy.c', needed by 'board_phy.o'.
gmake: *** No rule to make target 'C:/ti/PRU-ICSS-EtherCAT_Slave_01.00.07.02/examples/board/iceAM335x/board_platform.c', needed by 'board_platform.o'.
gmake: *** No rule to make target 'C:/ti/PRU-ICSS-EtherCAT_Slave_01.00.07.02/examples/board/common/board_rotary_switch.c', needed by 'board_rotary_switch.o'.
gmake: *** No rule to make target 'C:/ti/PRU-ICSS-EtherCAT_Slave_01.00.07.02/examples/board/iceAM335x/board_spi.c', needed by 'board_spi.o'.
gmake: *** No rule to make target 'C:/ti/PRU-ICSS-EtherCAT_Slave_01.00.07.02/examples/board/common/board_tlk110.c', needed by 'board_tlk110.o'.
gmake: *** No rule to make target 'C:/ti/PRU-ICSS-EtherCAT_Slave_01.00.07.02/examples/board/common/board_tlkphy.c', needed by 'board_tlkphy.o'.
gmake: *** No rule to make target 'C:/ti/PRU-ICSS-EtherCAT_Slave_01.00.07.02/examples/board/common/delay_us.c', needed by 'delay_us.o'.
gmake: *** No rule to make target 'C:/ti/PRU-ICSS-EtherCAT_Slave_01.00.07.02/examples/board/common/oled_drv.c', needed by 'oled_drv.o'.
gmake: *** No rule to make target 'C:/ti/PRU-ICSS-EtherCAT_Slave_01.00.07.02/protocols/ethercat_slave/ecat_appl/EcatStack/tiesc_fw_cir_buff.c', needed by 'tiesc_fw_cir_buff.o'.
gmake: *** No rule to make target 'C:/ti/PRU-ICSS-EtherCAT_Slave_01.00.07.02/protocols/ethercat_slave/ecat_appl/iceAM335x/tiesc_soc.c', needed by 'tiesc_soc.o'.
gmake: *** No rule to make target 'C:/ti/PRU-ICSS-EtherCAT_Slave_01.00.07.02/examples/ethercat_slave/tiescappl.c', needed by 'tiescappl.o'.
gmake: *** No rule to make target 'C:/ti/PRU-ICSS-EtherCAT_Slave_01.00.07.02/protocols/ethercat_slave/ecat_appl/EcatStack/tiescbsp.c', needed by 'tiescbsp.o'.
gmake: *** No rule to make target 'C:/ti/PRU-ICSS-EtherCAT_Slave_01.00.07.02/protocols/ethercat_slave/ecat_appl/EcatStack/tieschw.c', needed by 'tieschw.o'.
gmake: *** No rule to make target 'C:/ti/PRU-ICSS-EtherCAT_Slave_01.00.07.02/protocols/ethercat_slave/ecat_appl/EcatStack/tiescmiscappl.c', needed by 'tiescmiscappl.o'.
gmake: *** No rule to make target 'C:/ti/PRU-ICSS-EtherCAT_Slave_01.00.07.02/protocols/ethercat_slave/ecat_appl/iceAM335x/tiescphy_tlk110.c', needed by 'tiescphy_tlk110.o'.
gmake: *** No rule to make target 'C:/ti/PRU-ICSS-EtherCAT_Slave_01.00.07.02/examples/ethercat_slave/tiescutils.c', needed by 'tiescutils.o'.
gmake[1]: *** No rule to make target 'C:/ti/PRU-ICSS-EtherCAT_Slave_01.00.07.02/protocols/ethercat_slave/ecat_appl/am335x_app.cfg', needed by 'build-445097391-inproc'.
gmake[1]: Target 'build-445097391-inproc' not remade because of errors.
gmake: *** [build-445097391] Error 2
gmake: Target 'all' not remade because of errors.

**** Build Finished ****

  • Hello Manuel,

    I have responded to original post. Copying the response to this thread as well to continue the discussion

    The error 'No rule to make target...' indicates that the some of the required source files are NOT linked correctly to the CCS project. This can happen if there are errors with some of the build variables associated with the project

    Could you please try to generate the Ethercat slave CCS project using the project creation scripts provided in the installer setup package (C:/ti/PRU-ICSS-EtherCAT_Slave_01.00.07.02/protocols/ethercat_slave/projects/projectCreate.bat). Refer to documentation https://software-dl.ti.com/processor-industrial-sw/esd/docs/indsw/EtherCAT_Slave/01_00_08/PRU_ICSS_EtherCAT.html#generating-project-files

    Also note that there is a latest version of EtherCAT Slave industrial package available for download at https://software-dl.ti.com/processor-industrial-sw/esd/PRU-ICSS-ETHERCAT-SLAVE/latest/index_FDS.html

    The XDC tools version mismatch warning indicates that the XDC tools version specified in the CCS project and that installed in CCS products does not match exactly. This can be resolved by following the system requirements specified for a specific version of industrial package (eg: https://software-dl.ti.com/processor-industrial-sw/esd/docs/indsw/EtherCAT_Slave/01_00_08/PRU_ICSS_EtherCAT.html#system-requirements

    Please let us know if you are facing any further errors.

    Regards,
    Nijin P

  • Hello Nijin,

    thank you for your answer. I followed the steps described, modified the file as required and got the following echo to the cmd line:

    ++++++++++++++++++++

    C:\ti\PRU-ICSS-EtherCAT_Slave_01.00.08.01\protocols\ethercat_slave\projects>projectCreate_BUF.bat AM335x arm ethercat_slave_demo
    **************************************************************************
    Environment Configuration Summary:
    CCS Install Directory : C:\ti\ccs1011\ccs
    CCS Workspace Directory : C:\Daten\TI_CC Workspace
    SDK Install Directory : C:\ti\PRU-ICSS-EtherCAT_Slave_01.00.08.01
    PDK Install Directory : C:\ti\pdk_am335x_1_0_17\packages
    Projects create Directory : C:\ti\PRU-ICSS-EtherCAT_Slave_01.00.08.01\protocols\ethercat_slave\projects
    Project create args directory : C:\ti\PRU-ICSS-EtherCAT_Slave_01.00.08.01\protocols\ethercat_slave\projects\ccsproject_args
    **************************************************************************

    Creating project 'ethercat_slave_demo_AM335x_arm' for 'AM335x' platform in directory 'C:\ti\PRU-ICSS-EtherCAT_Slave_01.00.08.01\protocols\ethercat_slave\projects\ethercat_slave_demo_AM335x_arm' by overwriting the project if it exists already...

    --------------------------------------------------------------------------------
    Creating project 'ethercat_slave_demo_AM335x_arm'...

    NOTE: Compiler version 'GNU_7.3.1:Linaro' is not currently installed! - defaulting to 'GNU_7.2.1:Linaro'.
    !WARNING: No XDCtools, equivalent to the specified version '3.55.2.22', are available - defaulting to '3.61.2.27_core'.

    Done!

    ++++++++++++++++++++++

    After that, the build process got much further. I copied the complete console output. I marked the error lines in red

    **** Build of configuration AM335x_release for project ethercat_slave_demo_AM335x_arm ****

    "C:\\ti\\ccs1011\\ccs\\utils\\bin\\gmake" -k -j 8 all -O

    Building file: "C:/ti/PRU-ICSS-EtherCAT_Slave_01.00.08.01/protocols/ethercat_slave/ecat_appl/am335x_app.cfg"
    Invoking: XDCtools
    "C:/ti/ccs1011/xdctools_3_61_02_27_core/xs" --xdcpath="C:/ti/bios_6_73_00_12/packages;C:/ti/pdk_am335x_1_0_12/packages;" xdc.tools.configuro -o configPkg -t gnu.targets.arm.A8F -p ti.platforms.evmAM3359 -r release -c "C:/ti/ccs1011/ccs/tools/compiler/gcc-arm-none-eabi-7-2017-q4-major-win32" "C:/ti/PRU-ICSS-EtherCAT_Slave_01.00.08.01/protocols/ethercat_slave/ecat_appl/am335x_app.cfg"
    making package.mak (because of package.bld) ...
    generating interfaces for package configPkg (because package/package.xdc.inc is older than package.xdc) ...
    configuring am335x_app.xa8fg from package/cfg/am335x_app_pa8fg.cfg ...
    generating custom ti.sysbios library makefile ...
    Linking with library ti.drv.spi:./lib/am335x/a8/release/ti.drv.spi.aa8fg
    Linking with library ti.board:./lib/icev2AM335x/a8/release/ti.board.aa8fg
    Linking with library ti.csl:./lib/am335x/a8/release/ti.csl.aa8fg
    Linking with library ti.drv.gpio:./lib/a8/release/ti.drv.gpio.aa8fg
    Linking with library ti.drv.pruss:./lib/a8/release/ti.drv.pruss.aa8fg
    Linking with library ti.drv.i2c:./lib/a8/release/ti.drv.i2c.aa8fg
    Linking with library ti.drv.uart:./lib/a8/release/ti.drv.uart.aa8fg
    Linking with library ti.osal:./lib/tirtos/a8/release/ti.osal.aa8fg
    Starting build of library sources ...
    making C:/ti/PRU-ICSS-EtherCAT_Slave_01.00.08.01/protocols/ethercat_slave/ecat_appl/src/sysbios/sysbios.aa8fg ...
    asma8fg C:/ti/bios_6_73_00_12/packages/ti/sysbios/family/arm/IntrinsicsSupport_asm_gnu.asm ...
    asma8fg C:/ti/bios_6_73_00_12/packages/ti/sysbios/family/arm/TaskSupport_asm_gnu.asm ...
    asma8fg C:/ti/bios_6_73_00_12/packages/ti/sysbios/family/arm/a8/Cache_asm_gnu.sv7A ...
    asma8fg C:/ti/bios_6_73_00_12/packages/ti/sysbios/family/arm/a8/Mmu_asm_gnu.sv7A ...
    asma8fg C:/ti/bios_6_73_00_12/packages/ti/sysbios/family/arm/a8/TimestampProvider_asm_gnu.sv7A ...
    asma8fg C:/ti/bios_6_73_00_12/packages/ti/sysbios/family/arm/a8/intcps/Hwi_asm_gnu.sv7A ...
    asma8fg C:/ti/bios_6_73_00_12/packages/ti/sysbios/family/arm/exc/Exception_asm_gnu.asm ...
    asma8fg C:/ti/bios_6_73_00_12/packages/ti/sysbios/timers/dmtimer/Timer_asm_gnu.sv7A ...
    cla8fg C:/ti/bios_6_73_00_12/packages/ti/sysbios/BIOS.c ...
    cla8fg C:/ti/bios_6_73_00_12/packages/ti/sysbios/family/arm/IntrinsicsSupport.c ...
    cla8fg C:/ti/bios_6_73_00_12/packages/ti/sysbios/family/arm/TaskSupport.c ...
    cla8fg C:/ti/bios_6_73_00_12/packages/ti/sysbios/knl/Clock.c ...
    cla8fg C:/ti/bios_6_73_00_12/packages/ti/sysbios/knl/Idle.c ...
    cla8fg C:/ti/bios_6_73_00_12/packages/ti/sysbios/knl/Intrinsics.c ...
    cla8fg C:/ti/bios_6_73_00_12/packages/ti/sysbios/knl/Event.c ...
    cla8fg C:/ti/bios_6_73_00_12/packages/ti/sysbios/knl/Mailbox.c ...
    cla8fg C:/ti/bios_6_73_00_12/packages/ti/sysbios/knl/Queue.c ...
    cla8fg C:/ti/bios_6_73_00_12/packages/ti/sysbios/knl/Semaphore.c ...
    cla8fg C:/ti/bios_6_73_00_12/packages/ti/sysbios/knl/Swi.c ...
    cla8fg C:/ti/bios_6_73_00_12/packages/ti/sysbios/knl/Task.c ...
    cla8fg C:/ti/bios_6_73_00_12/packages/ti/sysbios/hal/Cache.c ...
    cla8fg C:/ti/bios_6_73_00_12/packages/ti/sysbios/hal/Core.c ...
    cla8fg C:/ti/bios_6_73_00_12/packages/ti/sysbios/hal/CoreNull.c ...
    cla8fg C:/ti/bios_6_73_00_12/packages/ti/sysbios/hal/Hwi.c ...
    cla8fg C:/ti/bios_6_73_00_12/packages/ti/sysbios/hal/Hwi_stack.c ...
    cla8fg C:/ti/bios_6_73_00_12/packages/ti/sysbios/hal/Hwi_startup.c ...
    cla8fg C:/ti/bios_6_73_00_12/packages/ti/sysbios/hal/Timer.c ...
    cla8fg C:/ti/bios_6_73_00_12/packages/ti/sysbios/heaps/HeapMem.c ...
    cla8fg C:/ti/bios_6_73_00_12/packages/ti/sysbios/family/arm/a8/Cache.c ...
    cla8fg C:/ti/bios_6_73_00_12/packages/ti/sysbios/family/arm/a8/Mmu.c ...
    cla8fg C:/ti/bios_6_73_00_12/packages/ti/sysbios/family/arm/a8/TimestampProvider.c ...
    cla8fg C:/ti/bios_6_73_00_12/packages/ti/sysbios/rts/gnu/ReentSupport.c ...
    cla8fg C:/ti/bios_6_73_00_12/packages/ti/sysbios/rts/gnu/SemiHostSupport.c ...
    cla8fg C:/ti/bios_6_73_00_12/packages/ti/sysbios/family/arm/a8/intcps/Hwi.c ...
    cla8fg C:/ti/bios_6_73_00_12/packages/ti/sysbios/family/arm/exc/Exception.c ...
    cla8fg C:/ti/bios_6_73_00_12/packages/ti/sysbios/gates/GateHwi.c ...
    cla8fg C:/ti/bios_6_73_00_12/packages/ti/sysbios/gates/GateMutex.c ...
    cla8fg C:/ti/bios_6_73_00_12/packages/ti/sysbios/timers/dmtimer/Timer.c ...
    cla8fg C:/ti/bios_6_73_00_12/packages/ti/sysbios/family/arm/a8/ti81xx/TimerSupport.c ...
    ara8fg arm_IntrinsicsSupport_asm_gnu.o arm_TaskSupport_asm_gnu.o a8_Cache_asm_gnu.o a8_Mmu_asm_gnu.o a8_TimestampProvider_asm_gnu.o intcps_Hwi_asm_gnu.o exc_Exception_asm_gnu.o dmtimer_Timer_asm_gnu.o _BIOS.o arm_IntrinsicsSupport.o arm_TaskSupport.o knl_Clock.o knl_Idle.o knl_Intrinsics.o knl_Event.o knl_Mailbox.o knl_Queue.o knl_Semaphore.o knl_Swi.o knl_Task.o hal_Cache.o hal_Core.o hal_CoreNull.o hal_Hwi.o hal_Hwi_stack.o hal_Hwi_startup.o hal_Timer.o heaps_HeapMem.o a8_Cache.o a8_Mmu.o a8_TimestampProvider.o gnu_ReentSupport.o gnu_SemiHostSupport.o intcps_Hwi.o exc_Exception.o gates_GateHwi.o gates_GateMutex.o dmtimer_Timer.o ti81xx_TimerSupport.o ...
    Build of libraries done.
    cla8fg package/cfg/am335x_app_pa8fg.c ...
    C:/ti/bios_6_73_00_12/packages/ti/sysbios/timers/dmtimer/Timer.c: In function 'ti_sysbios_timers_dmtimer_Timer_getFreq__E':
    C:/ti/bios_6_73_00_12/packages/ti/sysbios/timers/dmtimer/Timer.c:652:25: warning: comparison between pointer and integer
    if (obj->extFreq.lo != NULL) {
    ^~
    Finished building: "C:/ti/PRU-ICSS-EtherCAT_Slave_01.00.08.01/protocols/ethercat_slave/ecat_appl/am335x_app.cfg"

    gmake: *** No rule to make target 'C:/ti/pdk_am335x_1_0_17/packages/ti/drv/gpio/soc/am335x/GPIO_soc.c', needed by 'GPIO_soc.o'.
    gmake: *** No rule to make target 'C:/ti/pdk_am335x_1_0_17/packages/ti/drv/i2c/soc/am335x/I2C_soc.c', needed by 'I2C_soc.o'.
    gmake: *** No rule to make target 'C:/ti/pdk_am335x_1_0_17/packages/ti/drv/spi/soc/am335x/SPI_soc.c', needed by 'SPI_soc.o'.
    gmake: *** No rule to make target 'C:/ti/pdk_am335x_1_0_17/packages/ti/drv/uart/soc/am335x/UART_soc.c', needed by 'UART_soc.o'.
    gmake: *** No rule to make target 'C:/ti/pdk_am335x_1_0_17/packages/ti/drv/pruss/soc/am335x/pruicss_soc.c', needed by 'pruicss_soc.o'.

    Building file: "C:/ti/PRU-ICSS-EtherCAT_Slave_01.00.08.01/examples/board/iceAM335x/board_mcspi.c"
    Invoking: GNU Compiler
    "C:/ti/ccs1011/ccs/tools/compiler/gcc-arm-none-eabi-7-2017-q4-major-win32/bin/arm-none-eabi-gcc-7.2.1.exe" -c -mcpu=cortex-a8 -march=armv7-a -mtune=cortex-a8 -marm -mfloat-abi=hard -Dam3359 -DSOC_AM335x -Dicev2AM335x -DAM335X_FAMILY_BUILD -Dcore0 -DNO_UART_MSG_APP -DECAT_LIMITED_DEMO -I"C:/ti/PRU-ICSS-EtherCAT_Slave_01.00.08.01/protocols/ethercat_slave/projects/ethercat_slave_demo_AM335x_arm" -I"C:/ti/pdk_am335x_1_0_17/packages/ti/starterware/include" -I"C:/ti/pdk_am335x_1_0_17/packages/ti/starterware/include/am335x" -I"C:/ti/PRU-ICSS-EtherCAT_Slave_01.00.08.01" -I"C:/ti/PRU-ICSS-EtherCAT_Slave_01.00.08.01/protocols/ethercat_slave/include" -I"C:/ti/PRU-ICSS-EtherCAT_Slave_01.00.08.01/protocols/ethercat_slave/ecat_appl/EcatStack" -I"C:/ti/PRU-ICSS-EtherCAT_Slave_01.00.08.01/protocols/ethercat_slave/firmware/v1.0" -I"C:/ti/PRU-ICSS-EtherCAT_Slave_01.00.08.01/protocols/ethercat_slave/ecat_appl/iceAM335x" -I"C:/ti/PRU-ICSS-EtherCAT_Slave_01.00.08.01/examples" -I"C:/ti/ccs1011/ccs/tools/compiler/gcc-arm-none-eabi-7-2017-q4-major-win32/arm-none-eabi/include" -O2 -ffunction-sections -fdata-sections -g -gdwarf-2 -gstrict-dwarf -Wall -mno-unaligned-access -MMD -MP -MF"board_mcspi.d" -MT"board_mcspi.o" @"configPkg/compiler.opt" -o"board_mcspi.o" "C:/ti/PRU-ICSS-EtherCAT_Slave_01.00.08.01/examples/board/iceAM335x/board_mcspi.c"
    subdir_rules.mk:65: recipe for target 'board_mcspi.o' failed
    In file included from C:/ti/pdk_am335x_1_0_12/packages/ti/starterware/include/board.h:72:0,
    from C:/ti/PRU-ICSS-EtherCAT_Slave_01.00.08.01/examples/board/iceAM335x/board_mcspi.c:48:
    C:/ti/pdk_am335x_1_0_12/packages/ti/starterware/include/chipdb.h:77:10: fatal error: chipdb_defs.h: No such file or directory
    #include "chipdb_defs.h"
    ^~~~~~~~~~~~~~~
    compilation terminated.
    gmake: *** [board_mcspi.o] Error 1
    Building file: "C:/ti/PRU-ICSS-EtherCAT_Slave_01.00.08.01/examples/board/iceAM335x/board_gpioLed.c"
    Invoking: GNU Compiler
    "C:/ti/ccs1011/ccs/tools/compiler/gcc-arm-none-eabi-7-2017-q4-major-win32/bin/arm-none-eabi-gcc-7.2.1.exe" -c -mcpu=cortex-a8 -march=armv7-a -mtune=cortex-a8 -marm -mfloat-abi=hard -Dam3359 -DSOC_AM335x -Dicev2AM335x -DAM335X_FAMILY_BUILD -Dcore0 -DNO_UART_MSG_APP -DECAT_LIMITED_DEMO -I"C:/ti/PRU-ICSS-EtherCAT_Slave_01.00.08.01/protocols/ethercat_slave/projects/ethercat_slave_demo_AM335x_arm" -I"C:/ti/pdk_am335x_1_0_17/packages/ti/starterware/include" -I"C:/ti/pdk_am335x_1_0_17/packages/ti/starterware/include/am335x" -I"C:/ti/PRU-ICSS-EtherCAT_Slave_01.00.08.01" -I"C:/ti/PRU-ICSS-EtherCAT_Slave_01.00.08.01/protocols/ethercat_slave/include" -I"C:/ti/PRU-ICSS-EtherCAT_Slave_01.00.08.01/protocols/ethercat_slave/ecat_appl/EcatStack" -I"C:/ti/PRU-ICSS-EtherCAT_Slave_01.00.08.01/protocols/ethercat_slave/firmware/v1.0" -I"C:/ti/PRU-ICSS-EtherCAT_Slave_01.00.08.01/protocols/ethercat_slave/ecat_appl/iceAM335x" -I"C:/ti/PRU-ICSS-EtherCAT_Slave_01.00.08.01/examples" -I"C:/ti/ccs1011/ccs/tools/compiler/gcc-arm-none-eabi-7-2017-q4-major-win32/arm-none-eabi/include" -O2 -ffunction-sections -fdata-sections -g -gdwarf-2 -gstrict-dwarf -Wall -mno-unaligned-access -MMD -MP -MF"board_gpioLed.d" -MT"board_gpioLed.o" @"configPkg/compiler.opt" -o"board_gpioLed.o" "C:/ti/PRU-ICSS-EtherCAT_Slave_01.00.08.01/examples/board/iceAM335x/board_gpioLed.c"
    Finished building: "C:/ti/PRU-ICSS-EtherCAT_Slave_01.00.08.01/examples/board/iceAM335x/board_gpioLed.c"

    Building file: "C:/ti/PRU-ICSS-EtherCAT_Slave_01.00.08.01/examples/board/iceAM335x/board_i2cLed.c"
    Invoking: GNU Compiler
    "C:/ti/ccs1011/ccs/tools/compiler/gcc-arm-none-eabi-7-2017-q4-major-win32/bin/arm-none-eabi-gcc-7.2.1.exe" -c -mcpu=cortex-a8 -march=armv7-a -mtune=cortex-a8 -marm -mfloat-abi=hard -Dam3359 -DSOC_AM335x -Dicev2AM335x -DAM335X_FAMILY_BUILD -Dcore0 -DNO_UART_MSG_APP -DECAT_LIMITED_DEMO -I"C:/ti/PRU-ICSS-EtherCAT_Slave_01.00.08.01/protocols/ethercat_slave/projects/ethercat_slave_demo_AM335x_arm" -I"C:/ti/pdk_am335x_1_0_17/packages/ti/starterware/include" -I"C:/ti/pdk_am335x_1_0_17/packages/ti/starterware/include/am335x" -I"C:/ti/PRU-ICSS-EtherCAT_Slave_01.00.08.01" -I"C:/ti/PRU-ICSS-EtherCAT_Slave_01.00.08.01/protocols/ethercat_slave/include" -I"C:/ti/PRU-ICSS-EtherCAT_Slave_01.00.08.01/protocols/ethercat_slave/ecat_appl/EcatStack" -I"C:/ti/PRU-ICSS-EtherCAT_Slave_01.00.08.01/protocols/ethercat_slave/firmware/v1.0" -I"C:/ti/PRU-ICSS-EtherCAT_Slave_01.00.08.01/protocols/ethercat_slave/ecat_appl/iceAM335x" -I"C:/ti/PRU-ICSS-EtherCAT_Slave_01.00.08.01/examples" -I"C:/ti/ccs1011/ccs/tools/compiler/gcc-arm-none-eabi-7-2017-q4-major-win32/arm-none-eabi/include" -O2 -ffunction-sections -fdata-sections -g -gdwarf-2 -gstrict-dwarf -Wall -mno-unaligned-access -MMD -MP -MF"board_i2cLed.d" -MT"board_i2cLed.o" @"configPkg/compiler.opt" -o"board_i2cLed.o" "C:/ti/PRU-ICSS-EtherCAT_Slave_01.00.08.01/examples/board/iceAM335x/board_i2cLed.c"
    Finished building: "C:/ti/PRU-ICSS-EtherCAT_Slave_01.00.08.01/examples/board/iceAM335x/board_i2cLed.c"

    Building file: "C:/ti/PRU-ICSS-EtherCAT_Slave_01.00.08.01/examples/board/common/board_misc.c"
    Invoking: GNU Compiler
    "C:/ti/ccs1011/ccs/tools/compiler/gcc-arm-none-eabi-7-2017-q4-major-win32/bin/arm-none-eabi-gcc-7.2.1.exe" -c -mcpu=cortex-a8 -march=armv7-a -mtune=cortex-a8 -marm -mfloat-abi=hard -Dam3359 -DSOC_AM335x -Dicev2AM335x -DAM335X_FAMILY_BUILD -Dcore0 -DNO_UART_MSG_APP -DECAT_LIMITED_DEMO -I"C:/ti/PRU-ICSS-EtherCAT_Slave_01.00.08.01/protocols/ethercat_slave/projects/ethercat_slave_demo_AM335x_arm" -I"C:/ti/pdk_am335x_1_0_17/packages/ti/starterware/include" -I"C:/ti/pdk_am335x_1_0_17/packages/ti/starterware/include/am335x" -I"C:/ti/PRU-ICSS-EtherCAT_Slave_01.00.08.01" -I"C:/ti/PRU-ICSS-EtherCAT_Slave_01.00.08.01/protocols/ethercat_slave/include" -I"C:/ti/PRU-ICSS-EtherCAT_Slave_01.00.08.01/protocols/ethercat_slave/ecat_appl/EcatStack" -I"C:/ti/PRU-ICSS-EtherCAT_Slave_01.00.08.01/protocols/ethercat_slave/firmware/v1.0" -I"C:/ti/PRU-ICSS-EtherCAT_Slave_01.00.08.01/protocols/ethercat_slave/ecat_appl/iceAM335x" -I"C:/ti/PRU-ICSS-EtherCAT_Slave_01.00.08.01/examples" -I"C:/ti/ccs1011/ccs/tools/compiler/gcc-arm-none-eabi-7-2017-q4-major-win32/arm-none-eabi/include" -O2 -ffunction-sections -fdata-sections -g -gdwarf-2 -gstrict-dwarf -Wall -mno-unaligned-access -MMD -MP -MF"board_misc.d" -MT"board_misc.o" @"configPkg/compiler.opt" -o"board_misc.o" "C:/ti/PRU-ICSS-EtherCAT_Slave_01.00.08.01/examples/board/common/board_misc.c"
    Finished building: "C:/ti/PRU-ICSS-EtherCAT_Slave_01.00.08.01/examples/board/common/board_misc.c"

    Building file: "C:/ti/PRU-ICSS-EtherCAT_Slave_01.00.08.01/examples/board/iceAM335x/board_oled.c"
    Invoking: GNU Compiler
    "C:/ti/ccs1011/ccs/tools/compiler/gcc-arm-none-eabi-7-2017-q4-major-win32/bin/arm-none-eabi-gcc-7.2.1.exe" -c -mcpu=cortex-a8 -march=armv7-a -mtune=cortex-a8 -marm -mfloat-abi=hard -Dam3359 -DSOC_AM335x -Dicev2AM335x -DAM335X_FAMILY_BUILD -Dcore0 -DNO_UART_MSG_APP -DECAT_LIMITED_DEMO -I"C:/ti/PRU-ICSS-EtherCAT_Slave_01.00.08.01/protocols/ethercat_slave/projects/ethercat_slave_demo_AM335x_arm" -I"C:/ti/pdk_am335x_1_0_17/packages/ti/starterware/include" -I"C:/ti/pdk_am335x_1_0_17/packages/ti/starterware/include/am335x" -I"C:/ti/PRU-ICSS-EtherCAT_Slave_01.00.08.01" -I"C:/ti/PRU-ICSS-EtherCAT_Slave_01.00.08.01/protocols/ethercat_slave/include" -I"C:/ti/PRU-ICSS-EtherCAT_Slave_01.00.08.01/protocols/ethercat_slave/ecat_appl/EcatStack" -I"C:/ti/PRU-ICSS-EtherCAT_Slave_01.00.08.01/protocols/ethercat_slave/firmware/v1.0" -I"C:/ti/PRU-ICSS-EtherCAT_Slave_01.00.08.01/protocols/ethercat_slave/ecat_appl/iceAM335x" -I"C:/ti/PRU-ICSS-EtherCAT_Slave_01.00.08.01/examples" -I"C:/ti/ccs1011/ccs/tools/compiler/gcc-arm-none-eabi-7-2017-q4-major-win32/arm-none-eabi/include" -O2 -ffunction-sections -fdata-sections -g -gdwarf-2 -gstrict-dwarf -Wall -mno-unaligned-access -MMD -MP -MF"board_oled.d" -MT"board_oled.o" @"configPkg/compiler.opt" -o"board_oled.o" "C:/ti/PRU-ICSS-EtherCAT_Slave_01.00.08.01/examples/board/iceAM335x/board_oled.c"
    Finished building: "C:/ti/PRU-ICSS-EtherCAT_Slave_01.00.08.01/examples/board/iceAM335x/board_oled.c"

    Building file: "C:/ti/PRU-ICSS-EtherCAT_Slave_01.00.08.01/examples/board/iceAM335x/board_phy.c"
    Invoking: GNU Compiler
    "C:/ti/ccs1011/ccs/tools/compiler/gcc-arm-none-eabi-7-2017-q4-major-win32/bin/arm-none-eabi-gcc-7.2.1.exe" -c -mcpu=cortex-a8 -march=armv7-a -mtune=cortex-a8 -marm -mfloat-abi=hard -Dam3359 -DSOC_AM335x -Dicev2AM335x -DAM335X_FAMILY_BUILD -Dcore0 -DNO_UART_MSG_APP -DECAT_LIMITED_DEMO -I"C:/ti/PRU-ICSS-EtherCAT_Slave_01.00.08.01/protocols/ethercat_slave/projects/ethercat_slave_demo_AM335x_arm" -I"C:/ti/pdk_am335x_1_0_17/packages/ti/starterware/include" -I"C:/ti/pdk_am335x_1_0_17/packages/ti/starterware/include/am335x" -I"C:/ti/PRU-ICSS-EtherCAT_Slave_01.00.08.01" -I"C:/ti/PRU-ICSS-EtherCAT_Slave_01.00.08.01/protocols/ethercat_slave/include" -I"C:/ti/PRU-ICSS-EtherCAT_Slave_01.00.08.01/protocols/ethercat_slave/ecat_appl/EcatStack" -I"C:/ti/PRU-ICSS-EtherCAT_Slave_01.00.08.01/protocols/ethercat_slave/firmware/v1.0" -I"C:/ti/PRU-ICSS-EtherCAT_Slave_01.00.08.01/protocols/ethercat_slave/ecat_appl/iceAM335x" -I"C:/ti/PRU-ICSS-EtherCAT_Slave_01.00.08.01/examples" -I"C:/ti/ccs1011/ccs/tools/compiler/gcc-arm-none-eabi-7-2017-q4-major-win32/arm-none-eabi/include" -O2 -ffunction-sections -fdata-sections -g -gdwarf-2 -gstrict-dwarf -Wall -mno-unaligned-access -MMD -MP -MF"board_phy.d" -MT"board_phy.o" @"configPkg/compiler.opt" -o"board_phy.o" "C:/ti/PRU-ICSS-EtherCAT_Slave_01.00.08.01/examples/board/iceAM335x/board_phy.c"
    Finished building: "C:/ti/PRU-ICSS-EtherCAT_Slave_01.00.08.01/examples/board/iceAM335x/board_phy.c"

    Building file: "C:/ti/PRU-ICSS-EtherCAT_Slave_01.00.08.01/examples/board/iceAM335x/board_platform.c"
    Invoking: GNU Compiler
    "C:/ti/ccs1011/ccs/tools/compiler/gcc-arm-none-eabi-7-2017-q4-major-win32/bin/arm-none-eabi-gcc-7.2.1.exe" -c -mcpu=cortex-a8 -march=armv7-a -mtune=cortex-a8 -marm -mfloat-abi=hard -Dam3359 -DSOC_AM335x -Dicev2AM335x -DAM335X_FAMILY_BUILD -Dcore0 -DNO_UART_MSG_APP -DECAT_LIMITED_DEMO -I"C:/ti/PRU-ICSS-EtherCAT_Slave_01.00.08.01/protocols/ethercat_slave/projects/ethercat_slave_demo_AM335x_arm" -I"C:/ti/pdk_am335x_1_0_17/packages/ti/starterware/include" -I"C:/ti/pdk_am335x_1_0_17/packages/ti/starterware/include/am335x" -I"C:/ti/PRU-ICSS-EtherCAT_Slave_01.00.08.01" -I"C:/ti/PRU-ICSS-EtherCAT_Slave_01.00.08.01/protocols/ethercat_slave/include" -I"C:/ti/PRU-ICSS-EtherCAT_Slave_01.00.08.01/protocols/ethercat_slave/ecat_appl/EcatStack" -I"C:/ti/PRU-ICSS-EtherCAT_Slave_01.00.08.01/protocols/ethercat_slave/firmware/v1.0" -I"C:/ti/PRU-ICSS-EtherCAT_Slave_01.00.08.01/protocols/ethercat_slave/ecat_appl/iceAM335x" -I"C:/ti/PRU-ICSS-EtherCAT_Slave_01.00.08.01/examples" -I"C:/ti/ccs1011/ccs/tools/compiler/gcc-arm-none-eabi-7-2017-q4-major-win32/arm-none-eabi/include" -O2 -ffunction-sections -fdata-sections -g -gdwarf-2 -gstrict-dwarf -Wall -mno-unaligned-access -MMD -MP -MF"board_platform.d" -MT"board_platform.o" @"configPkg/compiler.opt" -o"board_platform.o" "C:/ti/PRU-ICSS-EtherCAT_Slave_01.00.08.01/examples/board/iceAM335x/board_platform.c"
    subdir_rules.mk:93: recipe for target 'board_platform.o' failed
    In file included from C:/ti/pdk_am335x_1_0_12/packages/ti/starterware/include/board.h:72:0,
    from C:/ti/PRU-ICSS-EtherCAT_Slave_01.00.08.01/examples/board/iceAM335x/board_platform.c:43:
    C:/ti/pdk_am335x_1_0_12/packages/ti/starterware/include/chipdb.h:77:10: fatal error: chipdb_defs.h: No such file or directory
    #include "chipdb_defs.h"
    ^~~~~~~~~~~~~~~
    compilation terminated.
    gmake: *** [board_platform.o] Error 1
    Building file: "C:/ti/PRU-ICSS-EtherCAT_Slave_01.00.08.01/examples/board/iceAM335x/board_spi.c"
    Invoking: GNU Compiler
    "C:/ti/ccs1011/ccs/tools/compiler/gcc-arm-none-eabi-7-2017-q4-major-win32/bin/arm-none-eabi-gcc-7.2.1.exe" -c -mcpu=cortex-a8 -march=armv7-a -mtune=cortex-a8 -marm -mfloat-abi=hard -Dam3359 -DSOC_AM335x -Dicev2AM335x -DAM335X_FAMILY_BUILD -Dcore0 -DNO_UART_MSG_APP -DECAT_LIMITED_DEMO -I"C:/ti/PRU-ICSS-EtherCAT_Slave_01.00.08.01/protocols/ethercat_slave/projects/ethercat_slave_demo_AM335x_arm" -I"C:/ti/pdk_am335x_1_0_17/packages/ti/starterware/include" -I"C:/ti/pdk_am335x_1_0_17/packages/ti/starterware/include/am335x" -I"C:/ti/PRU-ICSS-EtherCAT_Slave_01.00.08.01" -I"C:/ti/PRU-ICSS-EtherCAT_Slave_01.00.08.01/protocols/ethercat_slave/include" -I"C:/ti/PRU-ICSS-EtherCAT_Slave_01.00.08.01/protocols/ethercat_slave/ecat_appl/EcatStack" -I"C:/ti/PRU-ICSS-EtherCAT_Slave_01.00.08.01/protocols/ethercat_slave/firmware/v1.0" -I"C:/ti/PRU-ICSS-EtherCAT_Slave_01.00.08.01/protocols/ethercat_slave/ecat_appl/iceAM335x" -I"C:/ti/PRU-ICSS-EtherCAT_Slave_01.00.08.01/examples" -I"C:/ti/ccs1011/ccs/tools/compiler/gcc-arm-none-eabi-7-2017-q4-major-win32/arm-none-eabi/include" -O2 -ffunction-sections -fdata-sections -g -gdwarf-2 -gstrict-dwarf -Wall -mno-unaligned-access -MMD -MP -MF"board_spi.d" -MT"board_spi.o" @"configPkg/compiler.opt" -o"board_spi.o" "C:/ti/PRU-ICSS-EtherCAT_Slave_01.00.08.01/examples/board/iceAM335x/board_spi.c"
    subdir_rules.mk:107: recipe for target 'board_spi.o' failed
    In file included from C:/ti/pdk_am335x_1_0_12/packages/ti/starterware/include/board.h:72:0,
    from C:/ti/PRU-ICSS-EtherCAT_Slave_01.00.08.01/examples/board/iceAM335x/board_spi.c:46:
    C:/ti/pdk_am335x_1_0_12/packages/ti/starterware/include/chipdb.h:77:10: fatal error: chipdb_defs.h: No such file or directory
    #include "chipdb_defs.h"
    ^~~~~~~~~~~~~~~
    compilation terminated.
    gmake: *** [board_spi.o] Error 1
    Building file: "C:/ti/PRU-ICSS-EtherCAT_Slave_01.00.08.01/examples/board/common/board_rotary_switch.c"
    Invoking: GNU Compiler
    "C:/ti/ccs1011/ccs/tools/compiler/gcc-arm-none-eabi-7-2017-q4-major-win32/bin/arm-none-eabi-gcc-7.2.1.exe" -c -mcpu=cortex-a8 -march=armv7-a -mtune=cortex-a8 -marm -mfloat-abi=hard -Dam3359 -DSOC_AM335x -Dicev2AM335x -DAM335X_FAMILY_BUILD -Dcore0 -DNO_UART_MSG_APP -DECAT_LIMITED_DEMO -I"C:/ti/PRU-ICSS-EtherCAT_Slave_01.00.08.01/protocols/ethercat_slave/projects/ethercat_slave_demo_AM335x_arm" -I"C:/ti/pdk_am335x_1_0_17/packages/ti/starterware/include" -I"C:/ti/pdk_am335x_1_0_17/packages/ti/starterware/include/am335x" -I"C:/ti/PRU-ICSS-EtherCAT_Slave_01.00.08.01" -I"C:/ti/PRU-ICSS-EtherCAT_Slave_01.00.08.01/protocols/ethercat_slave/include" -I"C:/ti/PRU-ICSS-EtherCAT_Slave_01.00.08.01/protocols/ethercat_slave/ecat_appl/EcatStack" -I"C:/ti/PRU-ICSS-EtherCAT_Slave_01.00.08.01/protocols/ethercat_slave/firmware/v1.0" -I"C:/ti/PRU-ICSS-EtherCAT_Slave_01.00.08.01/protocols/ethercat_slave/ecat_appl/iceAM335x" -I"C:/ti/PRU-ICSS-EtherCAT_Slave_01.00.08.01/examples" -I"C:/ti/ccs1011/ccs/tools/compiler/gcc-arm-none-eabi-7-2017-q4-major-win32/arm-none-eabi/include" -O2 -ffunction-sections -fdata-sections -g -gdwarf-2 -gstrict-dwarf -Wall -mno-unaligned-access -MMD -MP -MF"board_rotary_switch.d" -MT"board_rotary_switch.o" @"configPkg/compiler.opt" -o"board_rotary_switch.o" "C:/ti/PRU-ICSS-EtherCAT_Slave_01.00.08.01/examples/board/common/board_rotary_switch.c"
    Finished building: "C:/ti/PRU-ICSS-EtherCAT_Slave_01.00.08.01/examples/board/common/board_rotary_switch.c"

    Building file: "C:/ti/PRU-ICSS-EtherCAT_Slave_01.00.08.01/examples/board/common/board_tlk110.c"
    Invoking: GNU Compiler
    "C:/ti/ccs1011/ccs/tools/compiler/gcc-arm-none-eabi-7-2017-q4-major-win32/bin/arm-none-eabi-gcc-7.2.1.exe" -c -mcpu=cortex-a8 -march=armv7-a -mtune=cortex-a8 -marm -mfloat-abi=hard -Dam3359 -DSOC_AM335x -Dicev2AM335x -DAM335X_FAMILY_BUILD -Dcore0 -DNO_UART_MSG_APP -DECAT_LIMITED_DEMO -I"C:/ti/PRU-ICSS-EtherCAT_Slave_01.00.08.01/protocols/ethercat_slave/projects/ethercat_slave_demo_AM335x_arm" -I"C:/ti/pdk_am335x_1_0_17/packages/ti/starterware/include" -I"C:/ti/pdk_am335x_1_0_17/packages/ti/starterware/include/am335x" -I"C:/ti/PRU-ICSS-EtherCAT_Slave_01.00.08.01" -I"C:/ti/PRU-ICSS-EtherCAT_Slave_01.00.08.01/protocols/ethercat_slave/include" -I"C:/ti/PRU-ICSS-EtherCAT_Slave_01.00.08.01/protocols/ethercat_slave/ecat_appl/EcatStack" -I"C:/ti/PRU-ICSS-EtherCAT_Slave_01.00.08.01/protocols/ethercat_slave/firmware/v1.0" -I"C:/ti/PRU-ICSS-EtherCAT_Slave_01.00.08.01/protocols/ethercat_slave/ecat_appl/iceAM335x" -I"C:/ti/PRU-ICSS-EtherCAT_Slave_01.00.08.01/examples" -I"C:/ti/ccs1011/ccs/tools/compiler/gcc-arm-none-eabi-7-2017-q4-major-win32/arm-none-eabi/include" -O2 -ffunction-sections -fdata-sections -g -gdwarf-2 -gstrict-dwarf -Wall -mno-unaligned-access -MMD -MP -MF"board_tlk110.d" -MT"board_tlk110.o" @"configPkg/compiler.opt" -o"board_tlk110.o" "C:/ti/PRU-ICSS-EtherCAT_Slave_01.00.08.01/examples/board/common/board_tlk110.c"
    Finished building: "C:/ti/PRU-ICSS-EtherCAT_Slave_01.00.08.01/examples/board/common/board_tlk110.c"

    Building file: "C:/ti/PRU-ICSS-EtherCAT_Slave_01.00.08.01/protocols/ethercat_slave/ecat_appl/iceAM335x/tiesc_soc.c"
    Invoking: GNU Compiler
    "C:/ti/ccs1011/ccs/tools/compiler/gcc-arm-none-eabi-7-2017-q4-major-win32/bin/arm-none-eabi-gcc-7.2.1.exe" -c -mcpu=cortex-a8 -march=armv7-a -mtune=cortex-a8 -marm -mfloat-abi=hard -Dam3359 -DSOC_AM335x -Dicev2AM335x -DAM335X_FAMILY_BUILD -Dcore0 -DNO_UART_MSG_APP -DECAT_LIMITED_DEMO -I"C:/ti/PRU-ICSS-EtherCAT_Slave_01.00.08.01/protocols/ethercat_slave/projects/ethercat_slave_demo_AM335x_arm" -I"C:/ti/pdk_am335x_1_0_17/packages/ti/starterware/include" -I"C:/ti/pdk_am335x_1_0_17/packages/ti/starterware/include/am335x" -I"C:/ti/PRU-ICSS-EtherCAT_Slave_01.00.08.01" -I"C:/ti/PRU-ICSS-EtherCAT_Slave_01.00.08.01/protocols/ethercat_slave/include" -I"C:/ti/PRU-ICSS-EtherCAT_Slave_01.00.08.01/protocols/ethercat_slave/ecat_appl/EcatStack" -I"C:/ti/PRU-ICSS-EtherCAT_Slave_01.00.08.01/protocols/ethercat_slave/firmware/v1.0" -I"C:/ti/PRU-ICSS-EtherCAT_Slave_01.00.08.01/protocols/ethercat_slave/ecat_appl/iceAM335x" -I"C:/ti/PRU-ICSS-EtherCAT_Slave_01.00.08.01/examples" -I"C:/ti/ccs1011/ccs/tools/compiler/gcc-arm-none-eabi-7-2017-q4-major-win32/arm-none-eabi/include" -O2 -ffunction-sections -fdata-sections -g -gdwarf-2 -gstrict-dwarf -Wall -mno-unaligned-access -MMD -MP -MF"tiesc_soc.d" -MT"tiesc_soc.o" @"configPkg/compiler.opt" -o"tiesc_soc.o" "C:/ti/PRU-ICSS-EtherCAT_Slave_01.00.08.01/protocols/ethercat_slave/ecat_appl/iceAM335x/tiesc_soc.c"
    subdir_rules.mk:156: recipe for target 'tiesc_soc.o' failed
    In file included from C:/ti/pdk_am335x_1_0_12/packages/ti/starterware/include/board.h:72:0,
    from C:/ti/PRU-ICSS-EtherCAT_Slave_01.00.08.01/protocols/ethercat_slave/include/tiesc_soc.h:41,
    from C:/ti/PRU-ICSS-EtherCAT_Slave_01.00.08.01/protocols/ethercat_slave/ecat_appl/iceAM335x/tiesc_soc.c:50:
    C:/ti/pdk_am335x_1_0_12/packages/ti/starterware/include/chipdb.h:77:10: fatal error: chipdb_defs.h: No such file or directory
    #include "chipdb_defs.h"
    ^~~~~~~~~~~~~~~
    compilation terminated.
    gmake: *** [tiesc_soc.o] Error 1
    Building file: "C:/ti/PRU-ICSS-EtherCAT_Slave_01.00.08.01/examples/board/common/delay_us.c"
    Invoking: GNU Compiler
    "C:/ti/ccs1011/ccs/tools/compiler/gcc-arm-none-eabi-7-2017-q4-major-win32/bin/arm-none-eabi-gcc-7.2.1.exe" -c -mcpu=cortex-a8 -march=armv7-a -mtune=cortex-a8 -marm -mfloat-abi=hard -Dam3359 -DSOC_AM335x -Dicev2AM335x -DAM335X_FAMILY_BUILD -Dcore0 -DNO_UART_MSG_APP -DECAT_LIMITED_DEMO -I"C:/ti/PRU-ICSS-EtherCAT_Slave_01.00.08.01/protocols/ethercat_slave/projects/ethercat_slave_demo_AM335x_arm" -I"C:/ti/pdk_am335x_1_0_17/packages/ti/starterware/include" -I"C:/ti/pdk_am335x_1_0_17/packages/ti/starterware/include/am335x" -I"C:/ti/PRU-ICSS-EtherCAT_Slave_01.00.08.01" -I"C:/ti/PRU-ICSS-EtherCAT_Slave_01.00.08.01/protocols/ethercat_slave/include" -I"C:/ti/PRU-ICSS-EtherCAT_Slave_01.00.08.01/protocols/ethercat_slave/ecat_appl/EcatStack" -I"C:/ti/PRU-ICSS-EtherCAT_Slave_01.00.08.01/protocols/ethercat_slave/firmware/v1.0" -I"C:/ti/PRU-ICSS-EtherCAT_Slave_01.00.08.01/protocols/ethercat_slave/ecat_appl/iceAM335x" -I"C:/ti/PRU-ICSS-EtherCAT_Slave_01.00.08.01/examples" -I"C:/ti/ccs1011/ccs/tools/compiler/gcc-arm-none-eabi-7-2017-q4-major-win32/arm-none-eabi/include" -O2 -ffunction-sections -fdata-sections -g -gdwarf-2 -gstrict-dwarf -Wall -mno-unaligned-access -MMD -MP -MF"delay_us.d" -MT"delay_us.o" @"configPkg/compiler.opt" -o"delay_us.o" "C:/ti/PRU-ICSS-EtherCAT_Slave_01.00.08.01/examples/board/common/delay_us.c"
    Finished building: "C:/ti/PRU-ICSS-EtherCAT_Slave_01.00.08.01/examples/board/common/delay_us.c"

    Building file: "C:/ti/PRU-ICSS-EtherCAT_Slave_01.00.08.01/examples/board/common/board_tlkphy.c"
    Invoking: GNU Compiler
    "C:/ti/ccs1011/ccs/tools/compiler/gcc-arm-none-eabi-7-2017-q4-major-win32/bin/arm-none-eabi-gcc-7.2.1.exe" -c -mcpu=cortex-a8 -march=armv7-a -mtune=cortex-a8 -marm -mfloat-abi=hard -Dam3359 -DSOC_AM335x -Dicev2AM335x -DAM335X_FAMILY_BUILD -Dcore0 -DNO_UART_MSG_APP -DECAT_LIMITED_DEMO -I"C:/ti/PRU-ICSS-EtherCAT_Slave_01.00.08.01/protocols/ethercat_slave/projects/ethercat_slave_demo_AM335x_arm" -I"C:/ti/pdk_am335x_1_0_17/packages/ti/starterware/include" -I"C:/ti/pdk_am335x_1_0_17/packages/ti/starterware/include/am335x" -I"C:/ti/PRU-ICSS-EtherCAT_Slave_01.00.08.01" -I"C:/ti/PRU-ICSS-EtherCAT_Slave_01.00.08.01/protocols/ethercat_slave/include" -I"C:/ti/PRU-ICSS-EtherCAT_Slave_01.00.08.01/protocols/ethercat_slave/ecat_appl/EcatStack" -I"C:/ti/PRU-ICSS-EtherCAT_Slave_01.00.08.01/protocols/ethercat_slave/firmware/v1.0" -I"C:/ti/PRU-ICSS-EtherCAT_Slave_01.00.08.01/protocols/ethercat_slave/ecat_appl/iceAM335x" -I"C:/ti/PRU-ICSS-EtherCAT_Slave_01.00.08.01/examples" -I"C:/ti/ccs1011/ccs/tools/compiler/gcc-arm-none-eabi-7-2017-q4-major-win32/arm-none-eabi/include" -O2 -ffunction-sections -fdata-sections -g -gdwarf-2 -gstrict-dwarf -Wall -mno-unaligned-access -MMD -MP -MF"board_tlkphy.d" -MT"board_tlkphy.o" @"configPkg/compiler.opt" -o"board_tlkphy.o" "C:/ti/PRU-ICSS-EtherCAT_Slave_01.00.08.01/examples/board/common/board_tlkphy.c"
    Finished building: "C:/ti/PRU-ICSS-EtherCAT_Slave_01.00.08.01/examples/board/common/board_tlkphy.c"

    Building file: "C:/ti/PRU-ICSS-EtherCAT_Slave_01.00.08.01/protocols/ethercat_slave/ecat_appl/EcatStack/tiesc_fw_cir_buff.c"
    Invoking: GNU Compiler
    "C:/ti/ccs1011/ccs/tools/compiler/gcc-arm-none-eabi-7-2017-q4-major-win32/bin/arm-none-eabi-gcc-7.2.1.exe" -c -mcpu=cortex-a8 -march=armv7-a -mtune=cortex-a8 -marm -mfloat-abi=hard -Dam3359 -DSOC_AM335x -Dicev2AM335x -DAM335X_FAMILY_BUILD -Dcore0 -DNO_UART_MSG_APP -DECAT_LIMITED_DEMO -I"C:/ti/PRU-ICSS-EtherCAT_Slave_01.00.08.01/protocols/ethercat_slave/projects/ethercat_slave_demo_AM335x_arm" -I"C:/ti/pdk_am335x_1_0_17/packages/ti/starterware/include" -I"C:/ti/pdk_am335x_1_0_17/packages/ti/starterware/include/am335x" -I"C:/ti/PRU-ICSS-EtherCAT_Slave_01.00.08.01" -I"C:/ti/PRU-ICSS-EtherCAT_Slave_01.00.08.01/protocols/ethercat_slave/include" -I"C:/ti/PRU-ICSS-EtherCAT_Slave_01.00.08.01/protocols/ethercat_slave/ecat_appl/EcatStack" -I"C:/ti/PRU-ICSS-EtherCAT_Slave_01.00.08.01/protocols/ethercat_slave/firmware/v1.0" -I"C:/ti/PRU-ICSS-EtherCAT_Slave_01.00.08.01/protocols/ethercat_slave/ecat_appl/iceAM335x" -I"C:/ti/PRU-ICSS-EtherCAT_Slave_01.00.08.01/examples" -I"C:/ti/ccs1011/ccs/tools/compiler/gcc-arm-none-eabi-7-2017-q4-major-win32/arm-none-eabi/include" -O2 -ffunction-sections -fdata-sections -g -gdwarf-2 -gstrict-dwarf -Wall -mno-unaligned-access -MMD -MP -MF"tiesc_fw_cir_buff.d" -MT"tiesc_fw_cir_buff.o" @"configPkg/compiler.opt" -o"tiesc_fw_cir_buff.o" "C:/ti/PRU-ICSS-EtherCAT_Slave_01.00.08.01/protocols/ethercat_slave/ecat_appl/EcatStack/tiesc_fw_cir_buff.c"
    Finished building: "C:/ti/PRU-ICSS-EtherCAT_Slave_01.00.08.01/protocols/ethercat_slave/ecat_appl/EcatStack/tiesc_fw_cir_buff.c"

    Building file: "C:/ti/PRU-ICSS-EtherCAT_Slave_01.00.08.01/examples/board/common/oled_drv.c"
    Invoking: GNU Compiler
    "C:/ti/ccs1011/ccs/tools/compiler/gcc-arm-none-eabi-7-2017-q4-major-win32/bin/arm-none-eabi-gcc-7.2.1.exe" -c -mcpu=cortex-a8 -march=armv7-a -mtune=cortex-a8 -marm -mfloat-abi=hard -Dam3359 -DSOC_AM335x -Dicev2AM335x -DAM335X_FAMILY_BUILD -Dcore0 -DNO_UART_MSG_APP -DECAT_LIMITED_DEMO -I"C:/ti/PRU-ICSS-EtherCAT_Slave_01.00.08.01/protocols/ethercat_slave/projects/ethercat_slave_demo_AM335x_arm" -I"C:/ti/pdk_am335x_1_0_17/packages/ti/starterware/include" -I"C:/ti/pdk_am335x_1_0_17/packages/ti/starterware/include/am335x" -I"C:/ti/PRU-ICSS-EtherCAT_Slave_01.00.08.01" -I"C:/ti/PRU-ICSS-EtherCAT_Slave_01.00.08.01/protocols/ethercat_slave/include" -I"C:/ti/PRU-ICSS-EtherCAT_Slave_01.00.08.01/protocols/ethercat_slave/ecat_appl/EcatStack" -I"C:/ti/PRU-ICSS-EtherCAT_Slave_01.00.08.01/protocols/ethercat_slave/firmware/v1.0" -I"C:/ti/PRU-ICSS-EtherCAT_Slave_01.00.08.01/protocols/ethercat_slave/ecat_appl/iceAM335x" -I"C:/ti/PRU-ICSS-EtherCAT_Slave_01.00.08.01/examples" -I"C:/ti/ccs1011/ccs/tools/compiler/gcc-arm-none-eabi-7-2017-q4-major-win32/arm-none-eabi/include" -O2 -ffunction-sections -fdata-sections -g -gdwarf-2 -gstrict-dwarf -Wall -mno-unaligned-access -MMD -MP -MF"oled_drv.d" -MT"oled_drv.o" @"configPkg/compiler.opt" -o"oled_drv.o" "C:/ti/PRU-ICSS-EtherCAT_Slave_01.00.08.01/examples/board/common/oled_drv.c"
    Finished building: "C:/ti/PRU-ICSS-EtherCAT_Slave_01.00.08.01/examples/board/common/oled_drv.c"

    Building file: "C:/ti/PRU-ICSS-EtherCAT_Slave_01.00.08.01/protocols/ethercat_slave/ecat_appl/EcatStack/tiescbsp.c"
    Invoking: GNU Compiler
    "C:/ti/ccs1011/ccs/tools/compiler/gcc-arm-none-eabi-7-2017-q4-major-win32/bin/arm-none-eabi-gcc-7.2.1.exe" -c -mcpu=cortex-a8 -march=armv7-a -mtune=cortex-a8 -marm -mfloat-abi=hard -Dam3359 -DSOC_AM335x -Dicev2AM335x -DAM335X_FAMILY_BUILD -Dcore0 -DNO_UART_MSG_APP -DECAT_LIMITED_DEMO -I"C:/ti/PRU-ICSS-EtherCAT_Slave_01.00.08.01/protocols/ethercat_slave/projects/ethercat_slave_demo_AM335x_arm" -I"C:/ti/pdk_am335x_1_0_17/packages/ti/starterware/include" -I"C:/ti/pdk_am335x_1_0_17/packages/ti/starterware/include/am335x" -I"C:/ti/PRU-ICSS-EtherCAT_Slave_01.00.08.01" -I"C:/ti/PRU-ICSS-EtherCAT_Slave_01.00.08.01/protocols/ethercat_slave/include" -I"C:/ti/PRU-ICSS-EtherCAT_Slave_01.00.08.01/protocols/ethercat_slave/ecat_appl/EcatStack" -I"C:/ti/PRU-ICSS-EtherCAT_Slave_01.00.08.01/protocols/ethercat_slave/firmware/v1.0" -I"C:/ti/PRU-ICSS-EtherCAT_Slave_01.00.08.01/protocols/ethercat_slave/ecat_appl/iceAM335x" -I"C:/ti/PRU-ICSS-EtherCAT_Slave_01.00.08.01/examples" -I"C:/ti/ccs1011/ccs/tools/compiler/gcc-arm-none-eabi-7-2017-q4-major-win32/arm-none-eabi/include" -O2 -ffunction-sections -fdata-sections -g -gdwarf-2 -gstrict-dwarf -Wall -mno-unaligned-access -MMD -MP -MF"tiescbsp.d" -MT"tiescbsp.o" @"configPkg/compiler.opt" -o"tiescbsp.o" "C:/ti/PRU-ICSS-EtherCAT_Slave_01.00.08.01/protocols/ethercat_slave/ecat_appl/EcatStack/tiescbsp.c"
    subdir_rules.mk:170: recipe for target 'tiescbsp.o' failed
    In file included from C:/ti/pdk_am335x_1_0_12/packages/ti/starterware/include/board.h:72:0,
    from C:/ti/PRU-ICSS-EtherCAT_Slave_01.00.08.01/protocols/ethercat_slave/include/tiesc_soc.h:41,
    from C:/ti/PRU-ICSS-EtherCAT_Slave_01.00.08.01/protocols/ethercat_slave/ecat_appl/EcatStack/tiescbsp.c:44:
    C:/ti/pdk_am335x_1_0_12/packages/ti/starterware/include/chipdb.h:77:10: fatal error: chipdb_defs.h: No such file or directory
    #include "chipdb_defs.h"
    ^~~~~~~~~~~~~~~
    compilation terminated.
    gmake: *** [tiescbsp.o] Error 1
    Building file: "C:/ti/PRU-ICSS-EtherCAT_Slave_01.00.08.01/protocols/ethercat_slave/ecat_appl/EcatStack/tieschw.c"
    Invoking: GNU Compiler
    "C:/ti/ccs1011/ccs/tools/compiler/gcc-arm-none-eabi-7-2017-q4-major-win32/bin/arm-none-eabi-gcc-7.2.1.exe" -c -mcpu=cortex-a8 -march=armv7-a -mtune=cortex-a8 -marm -mfloat-abi=hard -Dam3359 -DSOC_AM335x -Dicev2AM335x -DAM335X_FAMILY_BUILD -Dcore0 -DNO_UART_MSG_APP -DECAT_LIMITED_DEMO -I"C:/ti/PRU-ICSS-EtherCAT_Slave_01.00.08.01/protocols/ethercat_slave/projects/ethercat_slave_demo_AM335x_arm" -I"C:/ti/pdk_am335x_1_0_17/packages/ti/starterware/include" -I"C:/ti/pdk_am335x_1_0_17/packages/ti/starterware/include/am335x" -I"C:/ti/PRU-ICSS-EtherCAT_Slave_01.00.08.01" -I"C:/ti/PRU-ICSS-EtherCAT_Slave_01.00.08.01/protocols/ethercat_slave/include" -I"C:/ti/PRU-ICSS-EtherCAT_Slave_01.00.08.01/protocols/ethercat_slave/ecat_appl/EcatStack" -I"C:/ti/PRU-ICSS-EtherCAT_Slave_01.00.08.01/protocols/ethercat_slave/firmware/v1.0" -I"C:/ti/PRU-ICSS-EtherCAT_Slave_01.00.08.01/protocols/ethercat_slave/ecat_appl/iceAM335x" -I"C:/ti/PRU-ICSS-EtherCAT_Slave_01.00.08.01/examples" -I"C:/ti/ccs1011/ccs/tools/compiler/gcc-arm-none-eabi-7-2017-q4-major-win32/arm-none-eabi/include" -O2 -ffunction-sections -fdata-sections -g -gdwarf-2 -gstrict-dwarf -Wall -mno-unaligned-access -MMD -MP -MF"tieschw.d" -MT"tieschw.o" @"configPkg/compiler.opt" -o"tieschw.o" "C:/ti/PRU-ICSS-EtherCAT_Slave_01.00.08.01/protocols/ethercat_slave/ecat_appl/EcatStack/tieschw.c"
    subdir_rules.mk:177: recipe for target 'tieschw.o' failed
    In file included from C:/ti/pdk_am335x_1_0_12/packages/ti/starterware/include/board.h:72:0,
    from C:/ti/PRU-ICSS-EtherCAT_Slave_01.00.08.01/protocols/ethercat_slave/include/tiesc_soc.h:41,
    from C:/ti/PRU-ICSS-EtherCAT_Slave_01.00.08.01/protocols/ethercat_slave/ecat_appl/EcatStack/tieschw.c:59:
    C:/ti/pdk_am335x_1_0_12/packages/ti/starterware/include/chipdb.h:77:10: fatal error: chipdb_defs.h: No such file or directory
    #include "chipdb_defs.h"
    ^~~~~~~~~~~~~~~
    compilation terminated.
    gmake: *** [tieschw.o] Error 1
    Building file: "C:/ti/PRU-ICSS-EtherCAT_Slave_01.00.08.01/examples/ethercat_slave/tiescappl.c"
    Invoking: GNU Compiler
    "C:/ti/ccs1011/ccs/tools/compiler/gcc-arm-none-eabi-7-2017-q4-major-win32/bin/arm-none-eabi-gcc-7.2.1.exe" -c -mcpu=cortex-a8 -march=armv7-a -mtune=cortex-a8 -marm -mfloat-abi=hard -Dam3359 -DSOC_AM335x -Dicev2AM335x -DAM335X_FAMILY_BUILD -Dcore0 -DNO_UART_MSG_APP -DECAT_LIMITED_DEMO -I"C:/ti/PRU-ICSS-EtherCAT_Slave_01.00.08.01/protocols/ethercat_slave/projects/ethercat_slave_demo_AM335x_arm" -I"C:/ti/pdk_am335x_1_0_17/packages/ti/starterware/include" -I"C:/ti/pdk_am335x_1_0_17/packages/ti/starterware/include/am335x" -I"C:/ti/PRU-ICSS-EtherCAT_Slave_01.00.08.01" -I"C:/ti/PRU-ICSS-EtherCAT_Slave_01.00.08.01/protocols/ethercat_slave/include" -I"C:/ti/PRU-ICSS-EtherCAT_Slave_01.00.08.01/protocols/ethercat_slave/ecat_appl/EcatStack" -I"C:/ti/PRU-ICSS-EtherCAT_Slave_01.00.08.01/protocols/ethercat_slave/firmware/v1.0" -I"C:/ti/PRU-ICSS-EtherCAT_Slave_01.00.08.01/protocols/ethercat_slave/ecat_appl/iceAM335x" -I"C:/ti/PRU-ICSS-EtherCAT_Slave_01.00.08.01/examples" -I"C:/ti/ccs1011/ccs/tools/compiler/gcc-arm-none-eabi-7-2017-q4-major-win32/arm-none-eabi/include" -O2 -ffunction-sections -fdata-sections -g -gdwarf-2 -gstrict-dwarf -Wall -mno-unaligned-access -MMD -MP -MF"tiescappl.d" -MT"tiescappl.o" @"configPkg/compiler.opt" -o"tiescappl.o" "C:/ti/PRU-ICSS-EtherCAT_Slave_01.00.08.01/examples/ethercat_slave/tiescappl.c"
    Finished building: "C:/ti/PRU-ICSS-EtherCAT_Slave_01.00.08.01/examples/ethercat_slave/tiescappl.c"

    Building file: "C:/ti/PRU-ICSS-EtherCAT_Slave_01.00.08.01/examples/ethercat_slave/tiescutils.c"
    Invoking: GNU Compiler
    "C:/ti/ccs1011/ccs/tools/compiler/gcc-arm-none-eabi-7-2017-q4-major-win32/bin/arm-none-eabi-gcc-7.2.1.exe" -c -mcpu=cortex-a8 -march=armv7-a -mtune=cortex-a8 -marm -mfloat-abi=hard -Dam3359 -DSOC_AM335x -Dicev2AM335x -DAM335X_FAMILY_BUILD -Dcore0 -DNO_UART_MSG_APP -DECAT_LIMITED_DEMO -I"C:/ti/PRU-ICSS-EtherCAT_Slave_01.00.08.01/protocols/ethercat_slave/projects/ethercat_slave_demo_AM335x_arm" -I"C:/ti/pdk_am335x_1_0_17/packages/ti/starterware/include" -I"C:/ti/pdk_am335x_1_0_17/packages/ti/starterware/include/am335x" -I"C:/ti/PRU-ICSS-EtherCAT_Slave_01.00.08.01" -I"C:/ti/PRU-ICSS-EtherCAT_Slave_01.00.08.01/protocols/ethercat_slave/include" -I"C:/ti/PRU-ICSS-EtherCAT_Slave_01.00.08.01/protocols/ethercat_slave/ecat_appl/EcatStack" -I"C:/ti/PRU-ICSS-EtherCAT_Slave_01.00.08.01/protocols/ethercat_slave/firmware/v1.0" -I"C:/ti/PRU-ICSS-EtherCAT_Slave_01.00.08.01/protocols/ethercat_slave/ecat_appl/iceAM335x" -I"C:/ti/PRU-ICSS-EtherCAT_Slave_01.00.08.01/examples" -I"C:/ti/ccs1011/ccs/tools/compiler/gcc-arm-none-eabi-7-2017-q4-major-win32/arm-none-eabi/include" -O2 -ffunction-sections -fdata-sections -g -gdwarf-2 -gstrict-dwarf -Wall -mno-unaligned-access -MMD -MP -MF"tiescutils.d" -MT"tiescutils.o" @"configPkg/compiler.opt" -o"tiescutils.o" "C:/ti/PRU-ICSS-EtherCAT_Slave_01.00.08.01/examples/ethercat_slave/tiescutils.c"
    subdir_rules.mk:198: recipe for target 'tiescutils.o' failed
    In file included from C:/ti/pdk_am335x_1_0_12/packages/ti/starterware/include/board.h:72:0,
    from C:/ti/PRU-ICSS-EtherCAT_Slave_01.00.08.01/protocols/ethercat_slave/include/tiesc_soc.h:41,
    from C:/ti/PRU-ICSS-EtherCAT_Slave_01.00.08.01/examples/ethercat_slave/tiescutils.c:49:
    C:/ti/pdk_am335x_1_0_12/packages/ti/starterware/include/chipdb.h:77:10: fatal error: chipdb_defs.h: No such file or directory
    #include "chipdb_defs.h"
    ^~~~~~~~~~~~~~~
    compilation terminated.
    gmake: *** [tiescutils.o] Error 1
    Building file: "C:/ti/PRU-ICSS-EtherCAT_Slave_01.00.08.01/protocols/ethercat_slave/ecat_appl/EcatStack/tiescmiscappl.c"
    Invoking: GNU Compiler
    "C:/ti/ccs1011/ccs/tools/compiler/gcc-arm-none-eabi-7-2017-q4-major-win32/bin/arm-none-eabi-gcc-7.2.1.exe" -c -mcpu=cortex-a8 -march=armv7-a -mtune=cortex-a8 -marm -mfloat-abi=hard -Dam3359 -DSOC_AM335x -Dicev2AM335x -DAM335X_FAMILY_BUILD -Dcore0 -DNO_UART_MSG_APP -DECAT_LIMITED_DEMO -I"C:/ti/PRU-ICSS-EtherCAT_Slave_01.00.08.01/protocols/ethercat_slave/projects/ethercat_slave_demo_AM335x_arm" -I"C:/ti/pdk_am335x_1_0_17/packages/ti/starterware/include" -I"C:/ti/pdk_am335x_1_0_17/packages/ti/starterware/include/am335x" -I"C:/ti/PRU-ICSS-EtherCAT_Slave_01.00.08.01" -I"C:/ti/PRU-ICSS-EtherCAT_Slave_01.00.08.01/protocols/ethercat_slave/include" -I"C:/ti/PRU-ICSS-EtherCAT_Slave_01.00.08.01/protocols/ethercat_slave/ecat_appl/EcatStack" -I"C:/ti/PRU-ICSS-EtherCAT_Slave_01.00.08.01/protocols/ethercat_slave/firmware/v1.0" -I"C:/ti/PRU-ICSS-EtherCAT_Slave_01.00.08.01/protocols/ethercat_slave/ecat_appl/iceAM335x" -I"C:/ti/PRU-ICSS-EtherCAT_Slave_01.00.08.01/examples" -I"C:/ti/ccs1011/ccs/tools/compiler/gcc-arm-none-eabi-7-2017-q4-major-win32/arm-none-eabi/include" -O2 -ffunction-sections -fdata-sections -g -gdwarf-2 -gstrict-dwarf -Wall -mno-unaligned-access -MMD -MP -MF"tiescmiscappl.d" -MT"tiescmiscappl.o" @"configPkg/compiler.opt" -o"tiescmiscappl.o" "C:/ti/PRU-ICSS-EtherCAT_Slave_01.00.08.01/protocols/ethercat_slave/ecat_appl/EcatStack/tiescmiscappl.c"
    Finished building: "C:/ti/PRU-ICSS-EtherCAT_Slave_01.00.08.01/protocols/ethercat_slave/ecat_appl/EcatStack/tiescmiscappl.c"

    Building file: "C:/ti/PRU-ICSS-EtherCAT_Slave_01.00.08.01/protocols/ethercat_slave/ecat_appl/iceAM335x/tiescphy_tlk110.c"
    Invoking: GNU Compiler
    "C:/ti/ccs1011/ccs/tools/compiler/gcc-arm-none-eabi-7-2017-q4-major-win32/bin/arm-none-eabi-gcc-7.2.1.exe" -c -mcpu=cortex-a8 -march=armv7-a -mtune=cortex-a8 -marm -mfloat-abi=hard -Dam3359 -DSOC_AM335x -Dicev2AM335x -DAM335X_FAMILY_BUILD -Dcore0 -DNO_UART_MSG_APP -DECAT_LIMITED_DEMO -I"C:/ti/PRU-ICSS-EtherCAT_Slave_01.00.08.01/protocols/ethercat_slave/projects/ethercat_slave_demo_AM335x_arm" -I"C:/ti/pdk_am335x_1_0_17/packages/ti/starterware/include" -I"C:/ti/pdk_am335x_1_0_17/packages/ti/starterware/include/am335x" -I"C:/ti/PRU-ICSS-EtherCAT_Slave_01.00.08.01" -I"C:/ti/PRU-ICSS-EtherCAT_Slave_01.00.08.01/protocols/ethercat_slave/include" -I"C:/ti/PRU-ICSS-EtherCAT_Slave_01.00.08.01/protocols/ethercat_slave/ecat_appl/EcatStack" -I"C:/ti/PRU-ICSS-EtherCAT_Slave_01.00.08.01/protocols/ethercat_slave/firmware/v1.0" -I"C:/ti/PRU-ICSS-EtherCAT_Slave_01.00.08.01/protocols/ethercat_slave/ecat_appl/iceAM335x" -I"C:/ti/PRU-ICSS-EtherCAT_Slave_01.00.08.01/examples" -I"C:/ti/ccs1011/ccs/tools/compiler/gcc-arm-none-eabi-7-2017-q4-major-win32/arm-none-eabi/include" -O2 -ffunction-sections -fdata-sections -g -gdwarf-2 -gstrict-dwarf -Wall -mno-unaligned-access -MMD -MP -MF"tiescphy_tlk110.d" -MT"tiescphy_tlk110.o" @"configPkg/compiler.opt" -o"tiescphy_tlk110.o" "C:/ti/PRU-ICSS-EtherCAT_Slave_01.00.08.01/protocols/ethercat_slave/ecat_appl/iceAM335x/tiescphy_tlk110.c"
    Finished building: "C:/ti/PRU-ICSS-EtherCAT_Slave_01.00.08.01/protocols/ethercat_slave/ecat_appl/iceAM335x/tiescphy_tlk110.c"

    Building file: "C:/ti/PRU-ICSS-EtherCAT_Slave_01.00.08.01/examples/osal/ClockP_tirtos.c"
    Invoking: GNU Compiler
    "C:/ti/ccs1011/ccs/tools/compiler/gcc-arm-none-eabi-7-2017-q4-major-win32/bin/arm-none-eabi-gcc-7.2.1.exe" -c -mcpu=cortex-a8 -march=armv7-a -mtune=cortex-a8 -marm -mfloat-abi=hard -Dam3359 -DSOC_AM335x -Dicev2AM335x -DAM335X_FAMILY_BUILD -Dcore0 -DNO_UART_MSG_APP -DECAT_LIMITED_DEMO -I"C:/ti/PRU-ICSS-EtherCAT_Slave_01.00.08.01/protocols/ethercat_slave/projects/ethercat_slave_demo_AM335x_arm" -I"C:/ti/pdk_am335x_1_0_17/packages/ti/starterware/include" -I"C:/ti/pdk_am335x_1_0_17/packages/ti/starterware/include/am335x" -I"C:/ti/PRU-ICSS-EtherCAT_Slave_01.00.08.01" -I"C:/ti/PRU-ICSS-EtherCAT_Slave_01.00.08.01/protocols/ethercat_slave/include" -I"C:/ti/PRU-ICSS-EtherCAT_Slave_01.00.08.01/protocols/ethercat_slave/ecat_appl/EcatStack" -I"C:/ti/PRU-ICSS-EtherCAT_Slave_01.00.08.01/protocols/ethercat_slave/firmware/v1.0" -I"C:/ti/PRU-ICSS-EtherCAT_Slave_01.00.08.01/protocols/ethercat_slave/ecat_appl/iceAM335x" -I"C:/ti/PRU-ICSS-EtherCAT_Slave_01.00.08.01/examples" -I"C:/ti/ccs1011/ccs/tools/compiler/gcc-arm-none-eabi-7-2017-q4-major-win32/arm-none-eabi/include" -O2 -ffunction-sections -fdata-sections -g -gdwarf-2 -gstrict-dwarf -Wall -mno-unaligned-access -MMD -MP -MF"osal/ClockP_tirtos.d" -MT"osal/ClockP_tirtos.o" @"configPkg/compiler.opt" -o"osal/ClockP_tirtos.o" "C:/ti/PRU-ICSS-EtherCAT_Slave_01.00.08.01/examples/osal/ClockP_tirtos.c"
    Finished building: "C:/ti/PRU-ICSS-EtherCAT_Slave_01.00.08.01/examples/osal/ClockP_tirtos.c"

    Building file: "C:/ti/PRU-ICSS-EtherCAT_Slave_01.00.08.01/examples/osal/EventP_tirtos.c"
    Invoking: GNU Compiler
    "C:/ti/ccs1011/ccs/tools/compiler/gcc-arm-none-eabi-7-2017-q4-major-win32/bin/arm-none-eabi-gcc-7.2.1.exe" -c -mcpu=cortex-a8 -march=armv7-a -mtune=cortex-a8 -marm -mfloat-abi=hard -Dam3359 -DSOC_AM335x -Dicev2AM335x -DAM335X_FAMILY_BUILD -Dcore0 -DNO_UART_MSG_APP -DECAT_LIMITED_DEMO -I"C:/ti/PRU-ICSS-EtherCAT_Slave_01.00.08.01/protocols/ethercat_slave/projects/ethercat_slave_demo_AM335x_arm" -I"C:/ti/pdk_am335x_1_0_17/packages/ti/starterware/include" -I"C:/ti/pdk_am335x_1_0_17/packages/ti/starterware/include/am335x" -I"C:/ti/PRU-ICSS-EtherCAT_Slave_01.00.08.01" -I"C:/ti/PRU-ICSS-EtherCAT_Slave_01.00.08.01/protocols/ethercat_slave/include" -I"C:/ti/PRU-ICSS-EtherCAT_Slave_01.00.08.01/protocols/ethercat_slave/ecat_appl/EcatStack" -I"C:/ti/PRU-ICSS-EtherCAT_Slave_01.00.08.01/protocols/ethercat_slave/firmware/v1.0" -I"C:/ti/PRU-ICSS-EtherCAT_Slave_01.00.08.01/protocols/ethercat_slave/ecat_appl/iceAM335x" -I"C:/ti/PRU-ICSS-EtherCAT_Slave_01.00.08.01/examples" -I"C:/ti/ccs1011/ccs/tools/compiler/gcc-arm-none-eabi-7-2017-q4-major-win32/arm-none-eabi/include" -O2 -ffunction-sections -fdata-sections -g -gdwarf-2 -gstrict-dwarf -Wall -mno-unaligned-access -MMD -MP -MF"osal/EventP_tirtos.d" -MT"osal/EventP_tirtos.o" @"configPkg/compiler.opt" -o"osal/EventP_tirtos.o" "C:/ti/PRU-ICSS-EtherCAT_Slave_01.00.08.01/examples/osal/EventP_tirtos.c"
    Finished building: "C:/ti/PRU-ICSS-EtherCAT_Slave_01.00.08.01/examples/osal/EventP_tirtos.c"

    Building file: "C:/ti/PRU-ICSS-EtherCAT_Slave_01.00.08.01/examples/osal/OSP_nonos.c"
    Invoking: GNU Compiler
    "C:/ti/ccs1011/ccs/tools/compiler/gcc-arm-none-eabi-7-2017-q4-major-win32/bin/arm-none-eabi-gcc-7.2.1.exe" -c -mcpu=cortex-a8 -march=armv7-a -mtune=cortex-a8 -marm -mfloat-abi=hard -Dam3359 -DSOC_AM335x -Dicev2AM335x -DAM335X_FAMILY_BUILD -Dcore0 -DNO_UART_MSG_APP -DECAT_LIMITED_DEMO -I"C:/ti/PRU-ICSS-EtherCAT_Slave_01.00.08.01/protocols/ethercat_slave/projects/ethercat_slave_demo_AM335x_arm" -I"C:/ti/pdk_am335x_1_0_17/packages/ti/starterware/include" -I"C:/ti/pdk_am335x_1_0_17/packages/ti/starterware/include/am335x" -I"C:/ti/PRU-ICSS-EtherCAT_Slave_01.00.08.01" -I"C:/ti/PRU-ICSS-EtherCAT_Slave_01.00.08.01/protocols/ethercat_slave/include" -I"C:/ti/PRU-ICSS-EtherCAT_Slave_01.00.08.01/protocols/ethercat_slave/ecat_appl/EcatStack" -I"C:/ti/PRU-ICSS-EtherCAT_Slave_01.00.08.01/protocols/ethercat_slave/firmware/v1.0" -I"C:/ti/PRU-ICSS-EtherCAT_Slave_01.00.08.01/protocols/ethercat_slave/ecat_appl/iceAM335x" -I"C:/ti/PRU-ICSS-EtherCAT_Slave_01.00.08.01/examples" -I"C:/ti/ccs1011/ccs/tools/compiler/gcc-arm-none-eabi-7-2017-q4-major-win32/arm-none-eabi/include" -O2 -ffunction-sections -fdata-sections -g -gdwarf-2 -gstrict-dwarf -Wall -mno-unaligned-access -MMD -MP -MF"osal/OSP_nonos.d" -MT"osal/OSP_nonos.o" @"configPkg/compiler.opt" -o"osal/OSP_nonos.o" "C:/ti/PRU-ICSS-EtherCAT_Slave_01.00.08.01/examples/osal/OSP_nonos.c"
    Finished building: "C:/ti/PRU-ICSS-EtherCAT_Slave_01.00.08.01/examples/osal/OSP_nonos.c"

    Building file: "C:/ti/PRU-ICSS-EtherCAT_Slave_01.00.08.01/examples/osal/MailboxP_tirtos.c"
    Invoking: GNU Compiler
    "C:/ti/ccs1011/ccs/tools/compiler/gcc-arm-none-eabi-7-2017-q4-major-win32/bin/arm-none-eabi-gcc-7.2.1.exe" -c -mcpu=cortex-a8 -march=armv7-a -mtune=cortex-a8 -marm -mfloat-abi=hard -Dam3359 -DSOC_AM335x -Dicev2AM335x -DAM335X_FAMILY_BUILD -Dcore0 -DNO_UART_MSG_APP -DECAT_LIMITED_DEMO -I"C:/ti/PRU-ICSS-EtherCAT_Slave_01.00.08.01/protocols/ethercat_slave/projects/ethercat_slave_demo_AM335x_arm" -I"C:/ti/pdk_am335x_1_0_17/packages/ti/starterware/include" -I"C:/ti/pdk_am335x_1_0_17/packages/ti/starterware/include/am335x" -I"C:/ti/PRU-ICSS-EtherCAT_Slave_01.00.08.01" -I"C:/ti/PRU-ICSS-EtherCAT_Slave_01.00.08.01/protocols/ethercat_slave/include" -I"C:/ti/PRU-ICSS-EtherCAT_Slave_01.00.08.01/protocols/ethercat_slave/ecat_appl/EcatStack" -I"C:/ti/PRU-ICSS-EtherCAT_Slave_01.00.08.01/protocols/ethercat_slave/firmware/v1.0" -I"C:/ti/PRU-ICSS-EtherCAT_Slave_01.00.08.01/protocols/ethercat_slave/ecat_appl/iceAM335x" -I"C:/ti/PRU-ICSS-EtherCAT_Slave_01.00.08.01/examples" -I"C:/ti/ccs1011/ccs/tools/compiler/gcc-arm-none-eabi-7-2017-q4-major-win32/arm-none-eabi/include" -O2 -ffunction-sections -fdata-sections -g -gdwarf-2 -gstrict-dwarf -Wall -mno-unaligned-access -MMD -MP -MF"osal/MailboxP_tirtos.d" -MT"osal/MailboxP_tirtos.o" @"configPkg/compiler.opt" -o"osal/MailboxP_tirtos.o" "C:/ti/PRU-ICSS-EtherCAT_Slave_01.00.08.01/examples/osal/MailboxP_tirtos.c"
    Finished building: "C:/ti/PRU-ICSS-EtherCAT_Slave_01.00.08.01/examples/osal/MailboxP_tirtos.c"

    Building file: "C:/ti/PRU-ICSS-EtherCAT_Slave_01.00.08.01/examples/osal/MiscP_tirtos.c"
    Invoking: GNU Compiler
    "C:/ti/ccs1011/ccs/tools/compiler/gcc-arm-none-eabi-7-2017-q4-major-win32/bin/arm-none-eabi-gcc-7.2.1.exe" -c -mcpu=cortex-a8 -march=armv7-a -mtune=cortex-a8 -marm -mfloat-abi=hard -Dam3359 -DSOC_AM335x -Dicev2AM335x -DAM335X_FAMILY_BUILD -Dcore0 -DNO_UART_MSG_APP -DECAT_LIMITED_DEMO -I"C:/ti/PRU-ICSS-EtherCAT_Slave_01.00.08.01/protocols/ethercat_slave/projects/ethercat_slave_demo_AM335x_arm" -I"C:/ti/pdk_am335x_1_0_17/packages/ti/starterware/include" -I"C:/ti/pdk_am335x_1_0_17/packages/ti/starterware/include/am335x" -I"C:/ti/PRU-ICSS-EtherCAT_Slave_01.00.08.01" -I"C:/ti/PRU-ICSS-EtherCAT_Slave_01.00.08.01/protocols/ethercat_slave/include" -I"C:/ti/PRU-ICSS-EtherCAT_Slave_01.00.08.01/protocols/ethercat_slave/ecat_appl/EcatStack" -I"C:/ti/PRU-ICSS-EtherCAT_Slave_01.00.08.01/protocols/ethercat_slave/firmware/v1.0" -I"C:/ti/PRU-ICSS-EtherCAT_Slave_01.00.08.01/protocols/ethercat_slave/ecat_appl/iceAM335x" -I"C:/ti/PRU-ICSS-EtherCAT_Slave_01.00.08.01/examples" -I"C:/ti/ccs1011/ccs/tools/compiler/gcc-arm-none-eabi-7-2017-q4-major-win32/arm-none-eabi/include" -O2 -ffunction-sections -fdata-sections -g -gdwarf-2 -gstrict-dwarf -Wall -mno-unaligned-access -MMD -MP -MF"osal/MiscP_tirtos.d" -MT"osal/MiscP_tirtos.o" @"configPkg/compiler.opt" -o"osal/MiscP_tirtos.o" "C:/ti/PRU-ICSS-EtherCAT_Slave_01.00.08.01/examples/osal/MiscP_tirtos.c"
    Finished building: "C:/ti/PRU-ICSS-EtherCAT_Slave_01.00.08.01/examples/osal/MiscP_tirtos.c"

    Building file: "C:/ti/PRU-ICSS-EtherCAT_Slave_01.00.08.01/examples/osal/OSP_tirtos.c"
    Invoking: GNU Compiler
    "C:/ti/ccs1011/ccs/tools/compiler/gcc-arm-none-eabi-7-2017-q4-major-win32/bin/arm-none-eabi-gcc-7.2.1.exe" -c -mcpu=cortex-a8 -march=armv7-a -mtune=cortex-a8 -marm -mfloat-abi=hard -Dam3359 -DSOC_AM335x -Dicev2AM335x -DAM335X_FAMILY_BUILD -Dcore0 -DNO_UART_MSG_APP -DECAT_LIMITED_DEMO -I"C:/ti/PRU-ICSS-EtherCAT_Slave_01.00.08.01/protocols/ethercat_slave/projects/ethercat_slave_demo_AM335x_arm" -I"C:/ti/pdk_am335x_1_0_17/packages/ti/starterware/include" -I"C:/ti/pdk_am335x_1_0_17/packages/ti/starterware/include/am335x" -I"C:/ti/PRU-ICSS-EtherCAT_Slave_01.00.08.01" -I"C:/ti/PRU-ICSS-EtherCAT_Slave_01.00.08.01/protocols/ethercat_slave/include" -I"C:/ti/PRU-ICSS-EtherCAT_Slave_01.00.08.01/protocols/ethercat_slave/ecat_appl/EcatStack" -I"C:/ti/PRU-ICSS-EtherCAT_Slave_01.00.08.01/protocols/ethercat_slave/firmware/v1.0" -I"C:/ti/PRU-ICSS-EtherCAT_Slave_01.00.08.01/protocols/ethercat_slave/ecat_appl/iceAM335x" -I"C:/ti/PRU-ICSS-EtherCAT_Slave_01.00.08.01/examples" -I"C:/ti/ccs1011/ccs/tools/compiler/gcc-arm-none-eabi-7-2017-q4-major-win32/arm-none-eabi/include" -O2 -ffunction-sections -fdata-sections -g -gdwarf-2 -gstrict-dwarf -Wall -mno-unaligned-access -MMD -MP -MF"osal/OSP_tirtos.d" -MT"osal/OSP_tirtos.o" @"configPkg/compiler.opt" -o"osal/OSP_tirtos.o" "C:/ti/PRU-ICSS-EtherCAT_Slave_01.00.08.01/examples/osal/OSP_tirtos.c"
    Finished building: "C:/ti/PRU-ICSS-EtherCAT_Slave_01.00.08.01/examples/osal/OSP_tirtos.c"

    Building file: "C:/ti/PRU-ICSS-EtherCAT_Slave_01.00.08.01/examples/osal/SwiP_tirtos.c"
    Invoking: GNU Compiler
    "C:/ti/ccs1011/ccs/tools/compiler/gcc-arm-none-eabi-7-2017-q4-major-win32/bin/arm-none-eabi-gcc-7.2.1.exe" -c -mcpu=cortex-a8 -march=armv7-a -mtune=cortex-a8 -marm -mfloat-abi=hard -Dam3359 -DSOC_AM335x -Dicev2AM335x -DAM335X_FAMILY_BUILD -Dcore0 -DNO_UART_MSG_APP -DECAT_LIMITED_DEMO -I"C:/ti/PRU-ICSS-EtherCAT_Slave_01.00.08.01/protocols/ethercat_slave/projects/ethercat_slave_demo_AM335x_arm" -I"C:/ti/pdk_am335x_1_0_17/packages/ti/starterware/include" -I"C:/ti/pdk_am335x_1_0_17/packages/ti/starterware/include/am335x" -I"C:/ti/PRU-ICSS-EtherCAT_Slave_01.00.08.01" -I"C:/ti/PRU-ICSS-EtherCAT_Slave_01.00.08.01/protocols/ethercat_slave/include" -I"C:/ti/PRU-ICSS-EtherCAT_Slave_01.00.08.01/protocols/ethercat_slave/ecat_appl/EcatStack" -I"C:/ti/PRU-ICSS-EtherCAT_Slave_01.00.08.01/protocols/ethercat_slave/firmware/v1.0" -I"C:/ti/PRU-ICSS-EtherCAT_Slave_01.00.08.01/protocols/ethercat_slave/ecat_appl/iceAM335x" -I"C:/ti/PRU-ICSS-EtherCAT_Slave_01.00.08.01/examples" -I"C:/ti/ccs1011/ccs/tools/compiler/gcc-arm-none-eabi-7-2017-q4-major-win32/arm-none-eabi/include" -O2 -ffunction-sections -fdata-sections -g -gdwarf-2 -gstrict-dwarf -Wall -mno-unaligned-access -MMD -MP -MF"osal/SwiP_tirtos.d" -MT"osal/SwiP_tirtos.o" @"configPkg/compiler.opt" -o"osal/SwiP_tirtos.o" "C:/ti/PRU-ICSS-EtherCAT_Slave_01.00.08.01/examples/osal/SwiP_tirtos.c"
    Finished building: "C:/ti/PRU-ICSS-EtherCAT_Slave_01.00.08.01/examples/osal/SwiP_tirtos.c"

    Building file: "C:/ti/PRU-ICSS-EtherCAT_Slave_01.00.08.01/examples/osal/TaskP_nonos.c"
    Invoking: GNU Compiler
    "C:/ti/ccs1011/ccs/tools/compiler/gcc-arm-none-eabi-7-2017-q4-major-win32/bin/arm-none-eabi-gcc-7.2.1.exe" -c -mcpu=cortex-a8 -march=armv7-a -mtune=cortex-a8 -marm -mfloat-abi=hard -Dam3359 -DSOC_AM335x -Dicev2AM335x -DAM335X_FAMILY_BUILD -Dcore0 -DNO_UART_MSG_APP -DECAT_LIMITED_DEMO -I"C:/ti/PRU-ICSS-EtherCAT_Slave_01.00.08.01/protocols/ethercat_slave/projects/ethercat_slave_demo_AM335x_arm" -I"C:/ti/pdk_am335x_1_0_17/packages/ti/starterware/include" -I"C:/ti/pdk_am335x_1_0_17/packages/ti/starterware/include/am335x" -I"C:/ti/PRU-ICSS-EtherCAT_Slave_01.00.08.01" -I"C:/ti/PRU-ICSS-EtherCAT_Slave_01.00.08.01/protocols/ethercat_slave/include" -I"C:/ti/PRU-ICSS-EtherCAT_Slave_01.00.08.01/protocols/ethercat_slave/ecat_appl/EcatStack" -I"C:/ti/PRU-ICSS-EtherCAT_Slave_01.00.08.01/protocols/ethercat_slave/firmware/v1.0" -I"C:/ti/PRU-ICSS-EtherCAT_Slave_01.00.08.01/protocols/ethercat_slave/ecat_appl/iceAM335x" -I"C:/ti/PRU-ICSS-EtherCAT_Slave_01.00.08.01/examples" -I"C:/ti/ccs1011/ccs/tools/compiler/gcc-arm-none-eabi-7-2017-q4-major-win32/arm-none-eabi/include" -O2 -ffunction-sections -fdata-sections -g -gdwarf-2 -gstrict-dwarf -Wall -mno-unaligned-access -MMD -MP -MF"osal/TaskP_nonos.d" -MT"osal/TaskP_nonos.o" @"configPkg/compiler.opt" -o"osal/TaskP_nonos.o" "C:/ti/PRU-ICSS-EtherCAT_Slave_01.00.08.01/examples/osal/TaskP_nonos.c"
    Finished building: "C:/ti/PRU-ICSS-EtherCAT_Slave_01.00.08.01/examples/osal/TaskP_nonos.c"

    Building file: "C:/ti/PRU-ICSS-EtherCAT_Slave_01.00.08.01/examples/osal/TaskP_tirtos.c"
    Invoking: GNU Compiler
    "C:/ti/ccs1011/ccs/tools/compiler/gcc-arm-none-eabi-7-2017-q4-major-win32/bin/arm-none-eabi-gcc-7.2.1.exe" -c -mcpu=cortex-a8 -march=armv7-a -mtune=cortex-a8 -marm -mfloat-abi=hard -Dam3359 -DSOC_AM335x -Dicev2AM335x -DAM335X_FAMILY_BUILD -Dcore0 -DNO_UART_MSG_APP -DECAT_LIMITED_DEMO -I"C:/ti/PRU-ICSS-EtherCAT_Slave_01.00.08.01/protocols/ethercat_slave/projects/ethercat_slave_demo_AM335x_arm" -I"C:/ti/pdk_am335x_1_0_17/packages/ti/starterware/include" -I"C:/ti/pdk_am335x_1_0_17/packages/ti/starterware/include/am335x" -I"C:/ti/PRU-ICSS-EtherCAT_Slave_01.00.08.01" -I"C:/ti/PRU-ICSS-EtherCAT_Slave_01.00.08.01/protocols/ethercat_slave/include" -I"C:/ti/PRU-ICSS-EtherCAT_Slave_01.00.08.01/protocols/ethercat_slave/ecat_appl/EcatStack" -I"C:/ti/PRU-ICSS-EtherCAT_Slave_01.00.08.01/protocols/ethercat_slave/firmware/v1.0" -I"C:/ti/PRU-ICSS-EtherCAT_Slave_01.00.08.01/protocols/ethercat_slave/ecat_appl/iceAM335x" -I"C:/ti/PRU-ICSS-EtherCAT_Slave_01.00.08.01/examples" -I"C:/ti/ccs1011/ccs/tools/compiler/gcc-arm-none-eabi-7-2017-q4-major-win32/arm-none-eabi/include" -O2 -ffunction-sections -fdata-sections -g -gdwarf-2 -gstrict-dwarf -Wall -mno-unaligned-access -MMD -MP -MF"osal/TaskP_tirtos.d" -MT"osal/TaskP_tirtos.o" @"configPkg/compiler.opt" -o"osal/TaskP_tirtos.o" "C:/ti/PRU-ICSS-EtherCAT_Slave_01.00.08.01/examples/osal/TaskP_tirtos.c"
    Finished building: "C:/ti/PRU-ICSS-EtherCAT_Slave_01.00.08.01/examples/osal/TaskP_tirtos.c"

    gmake: Target 'all' not remade because of errors.

    **** Build Finished ****

    Sorry for the long answer, I suppose a few files are missing. Where would I find these files?