Part Number: TDA2EVM5777
Tool/software: Linux
Hello again,
So as recommended - we installed PROCESSOR_SDK_VISION_03_07_00_00.
Following the instructions in "VisionSDK_Linux_UserGuide.pdf" we managed to build a fully functional Linux system.
BTW - the script ./hlos/scripts/linux/mksdboot.sh should be fixed - we had to manually fix it, since the partitions created were {devicename}p1 and {devicename}p2, but the mount points are set to {devicename}1 and {devicename}2 and this is NOT working on UBUNTU 16.04LS. The ./memcache_load.sh had to be fixed, too - since the kernel module driver ./bin/memcache.ko is not loacated correctly
Anyway, we run the apps.out application but no OpenVX option appeared.
These are the options we saw:
[HOST] [HOST ] ====================
[HOST] [HOST ] Vision SDK Usecases
[HOST] [HOST ] ====================
[HOST] [HOST ] 1: Single Camera Usecases
[HOST] [HOST ] 2: Multi-Camera LVDS Usecases
[HOST] [HOST ] 3: Open-Compute Usecases
[HOST] [HOST ] 6: Radar Usecases
[HOST] [HOST ]
[HOST] [HOST ] 7: PCIe SSD card Write Test
[HOST] [HOST ] p: CPU Status
[HOST] [HOST ] i: Show IP Addr (IPU + NDK + AVB)
[HOST] [HOST ]
[HOST] [HOST ] s: System Settings
[HOST] [HOST ]
[HOST] [HOST ] x: Exit
[HOST] [HOST ] z: Exit - AND SHUTDOWN Remote CPUs
[HOST] [HOST ]
So, in order to have the OpenVX usecases to be part of the build - I modified $INSTALL_DIR/vision_sdk/apps/configs/tda2xx_evm_linux_all/cfg.mk and set OPENVX_INCLUDE=yes.
Once running again "make –s –j depend" - I got the following errors:
Makefile:359: recipe for target 'tiovx' failed
make[1]: *** [tiovx] Error 2
Makefile:274: recipe for target 'depend' failed
make: *** [depend] Error 2
The full log is attached.
So, what steps are missing in order to build the OpenVX usecases?
What have I done wrong? Probably didn't install the whole toolset?
Thanks
Yoav
yoav@yoav-Latitude-5490:~/PROCESSOR_SDK_VISION_03_07_00_00/vision_sdk/build$ make -s -j depend
mkdir: cannot create directory ‘/home/yoav/PROCESSOR_SDK_VISION_03_07_00_00/vision_sdk/links_fw/include/config’: File exists
mkdir: cannot create directory ‘/home/yoav/PROCESSOR_SDK_VISION_03_07_00_00/vision_sdk/links_fw/include/config/apps’: File exists
mkdir: cannot create directory ‘/home/yoav/PROCESSOR_SDK_VISION_03_07_00_00/vision_sdk/links_fw/include/config/apps/tda2xx_evm_linux_all’: File exists
# makeconfig: Config is [ tda2xx_evm_linux_all ]
# makeconfig: Output file is @ /home/yoav/PROCESSOR_SDK_VISION_03_07_00_00/vision_sdk/links_fw/include/config/apps/tda2xx_evm_linux_all/system_cfg.h
# makeconfig: Input file is @ /home/yoav/PROCESSOR_SDK_VISION_03_07_00_00/vision_sdk/apps/configs/tda2xx_evm_linux_all/cfg.mk
# makeconfig: Generating header ...
# makeconfig: Generating alg plugin config ...
# makeconfig: Generating usecase config ...
# makeconfig: Generating footer ...
# makeconfig: Done !!!
#
# CPUs that are NOT required but included in config [ tda2xx_evm_linux_all ],
#
#
# CPUs that are required but not included in config [ tda2xx_evm_linux_all ],
#
# ERROR: IPU1_0 MUST be included in application
#
# Edit /home/yoav/PROCESSOR_SDK_VISION_03_07_00_00/vision_sdk/apps/configs/tda2xx_evm_linux_all/cfg.mk to include or exclude CPUs in an application
#
Nothing to be done for tda2xx ipu1_0 csl_init
Nothing to be done for tda2xx csl_intc
Nothing to be done for tda2xx ipu1_0 sbl_utils
Nothing to be done for tda2xx pm_rtos
Nothing to be done for tda2xx ipu1_0 vps_osal_tirtos_smp
Nothing to be done for tda2xx ipu1_1 csl_init
Nothing to be done for tda2xx csl_intc
Nothing to be done for tda2xx ipu1_1 csl
Nothing to be done for tda2xx ipu1_1 csl_utils_common
Nothing to be done for tda2xx ipu1_1 csl_uart_console
Nothing to be done for tda2xx ipu1_1 csl_utils_i2c
Nothing to be done for tda2xx ipu1_1 pm_hal
Nothing to be done for tda2xx ipu1_1 pm_hal_optimized
Nothing to be done for tda2xx ipu1_1 pm_lib
Nothing to be done for tda2xx ipu1_1 pm_lib_optimized
Nothing to be done for tda2xx pm_rtos
Nothing to be done for tda2xx ipu1_1 sbl_lib
Nothing to be done for tda2xx ipu1_1 sbl_utils
Nothing to be done for tda2xx ipu1_1 diag
Nothing to be done for tda2xx ipu1_1 firewall_l3l4
Nothing to be done for tda2xx ipu1_1 norflash_lib
Nothing to be done for tda2xx ipu1_1 qspiflash_lib
Nothing to be done for tda2xx ipu1_1 i2c_lld
Nothing to be done for tda2xx ipu1_1 stw_platform
Nothing to be done for tda2xx ipu1_1 stw_uartconsole
Nothing to be done for tda2xx ipu1_1 stw_fatlib
Nothing to be done for tda2xx ipu1_1 stw_fatlib_edma
Nothing to be done for tda2xx ipu1_1 stw_boards
Nothing to be done for tda2xx ipu1_1 stw_devices
Nothing to be done for tda2xx ipu1_1 stw_examples_utility
Nothing to be done for tda2xx ipu1_1 vps_common
Nothing to be done for tda2xx ipu1_1 vpslib
Nothing to be done for tda2xx ipu1_1 vpsdrv_baremetal
Nothing to be done for tda2xx ipu1_1 fvid2
Nothing to be done for tda2xx ipu1_1 vps_osal_tirtos
Nothing to be done for tda2xx ipu1_1 vps_osal_tirtos_smp
Nothing to be done for tda2xx ipu1_1 vpsdrv
Nothing to be done for tda2xx ipu1_1 vps_platforms
Nothing to be done for tda2xx ipu1_1 vps_devices
Nothing to be done for tda2xx ipu1_1 vps_boards
Nothing to be done for tda2xx ipu1_1 vps_examples_utility
Nothing to be done for tda2xx ipu1_1 bsp_i2c
Nothing to be done for tda2xx ipu1_1 bsp_uart
Nothing to be done for tda2xx ipu1_1 bsp_mcspi
Nothing to be done for tda2xx ipu2_0 csl_init
Nothing to be done for tda2xx csl_intc
Nothing to be done for tda2xx ipu2_0 csl
Nothing to be done for tda2xx ipu2_0 csl_utils_common
Nothing to be done for tda2xx ipu2_0 csl_uart_console
Nothing to be done for tda2xx ipu2_0 csl_utils_i2c
Nothing to be done for tda2xx ipu2_0 pm_hal
Nothing to be done for tda2xx ipu2_0 pm_hal_optimized
Nothing to be done for tda2xx ipu2_0 pm_lib
Nothing to be done for tda2xx ipu2_0 pm_lib_optimized
Nothing to be done for tda2xx pm_rtos
Nothing to be done for tda2xx ipu2_0 sbl_lib
Nothing to be done for tda2xx ipu2_0 sbl_utils
Nothing to be done for tda2xx ipu2_0 diag
Nothing to be done for tda2xx ipu2_0 firewall_l3l4
Nothing to be done for tda2xx ipu2_0 norflash_lib
Nothing to be done for tda2xx ipu2_0 qspiflash_lib
Nothing to be done for tda2xx ipu2_0 i2c_lld
Nothing to be done for tda2xx ipu2_0 stw_platform
Nothing to be done for tda2xx ipu2_0 stw_uartconsole
Nothing to be done for tda2xx ipu2_0 stw_fatlib
Nothing to be done for tda2xx ipu2_0 stw_fatlib_edma
Nothing to be done for tda2xx ipu2_0 stw_boards
Nothing to be done for tda2xx ipu2_0 stw_devices
Nothing to be done for tda2xx ipu2_0 stw_examples_utility
Nothing to be done for tda2xx ipu2_0 vps_common
Nothing to be done for tda2xx ipu2_0 vpslib
Nothing to be done for tda2xx ipu2_0 vpsdrv_baremetal
Nothing to be done for tda2xx ipu2_0 fvid2
Nothing to be done for tda2xx ipu2_0 vps_osal_tirtos
Nothing to be done for tda2xx ipu2_0 vps_osal_tirtos_smp
Nothing to be done for tda2xx ipu2_0 vpsdrv
Nothing to be done for tda2xx ipu2_0 vps_platforms
Nothing to be done for tda2xx ipu2_0 vps_devices
Nothing to be done for tda2xx ipu2_0 vps_boards
Nothing to be done for tda2xx ipu2_0 vps_examples_utility
Nothing to be done for tda2xx ipu2_0 bsp_i2c
Nothing to be done for tda2xx ipu2_0 bsp_uart
Nothing to be done for tda2xx ipu2_0 bsp_mcspi
Nothing to be done for tda2xx c66x csl_init
Nothing to be done for tda2xx csl_intc
Nothing to be done for tda2xx c66x sbl_utils
Nothing to be done for tda2xx c66x ipc_lib
Nothing to be done for tda2xx c66x qspiflash_lib
Nothing to be done for tda2xx c66x diag
Nothing to be done for tda2xx c66x sbl_lib
Nothing to be done for tda2xx pm_rtos
Nothing to be done for tda2xx c66x norflash_lib
Nothing to be done for tda2xx c66x stw_fatlib_edma
Nothing to be done for tda2xx c66x vpslib
Nothing to be done for tda2xx c66x vps_osal_baremetal
Nothing to be done for tda2xx c66x vpsdrv_baremetal
Nothing to be done for tda2xx c66x fvid2
Nothing to be done for tda2xx c66x stw_fatlib
Nothing to be done for tda2xx c66x vps_common
Nothing to be done for tda2xx c66x vpsdrv
Nothing to be done for tda2xx c66x vps_boards
Nothing to be done for tda2xx c66x bsp_uart
Nothing to be done for tda2xx c66x vps_devices
Nothing to be done for tda2xx c66x vps_platforms
Nothing to be done for tda2xx c66x bsp_i2c
Nothing to be done for tda2xx c66x vps_osal_tirtos_smp
Nothing to be done for tda2xx c66x vps_examples_utility
Nothing to be done for tda2xx c66x bsp_mcspi
Nothing to be done for tda2xx c66xdsp_1 csl_init
Nothing to be done for tda2xx csl_intc
Nothing to be done for tda2xx c66xdsp_1 csl
Nothing to be done for tda2xx c66xdsp_1 csl_utils_common
Nothing to be done for tda2xx c66xdsp_1 csl_uart_console
Nothing to be done for tda2xx c66xdsp_1 csl_utils_i2c
Nothing to be done for tda2xx c66xdsp_1 pm_hal
Nothing to be done for tda2xx c66xdsp_1 pm_hal_optimized
Nothing to be done for tda2xx c66xdsp_1 pm_lib
Nothing to be done for tda2xx c66xdsp_1 pm_lib_optimized
Nothing to be done for tda2xx pm_rtos
Nothing to be done for tda2xx c66xdsp_1 sbl_lib
Nothing to be done for tda2xx c66xdsp_1 sbl_utils
Nothing to be done for tda2xx c66xdsp_1 diag
Nothing to be done for tda2xx c66xdsp_1 firewall_l3l4
Nothing to be done for tda2xx c66xdsp_1 norflash_lib
Nothing to be done for tda2xx c66xdsp_1 qspiflash_lib
Nothing to be done for tda2xx c66xdsp_1 i2c_lld
Nothing to be done for tda2xx c66xdsp_1 stw_platform
Nothing to be done for tda2xx c66xdsp_1 stw_uartconsole
Nothing to be done for tda2xx c66xdsp_1 stw_fatlib
Nothing to be done for tda2xx c66xdsp_1 stw_fatlib_edma
Nothing to be done for tda2xx c66xdsp_1 stw_boards
Nothing to be done for tda2xx c66xdsp_1 stw_devices
Nothing to be done for tda2xx c66xdsp_1 stw_examples_utility
Nothing to be done for tda2xx c66xdsp_1 vps_common
Nothing to be done for tda2xx c66xdsp_1 vpslib
Nothing to be done for tda2xx c66xdsp_1 vpsdrv_baremetal
Nothing to be done for tda2xx c66xdsp_1 fvid2
Nothing to be done for tda2xx c66xdsp_1 vps_osal_tirtos
Nothing to be done for tda2xx c66xdsp_1 vps_osal_tirtos_smp
Nothing to be done for tda2xx c66xdsp_1 vpsdrv
Nothing to be done for tda2xx c66xdsp_1 vps_platforms
Nothing to be done for tda2xx c66xdsp_1 vps_devices
Nothing to be done for tda2xx c66xdsp_1 vps_boards
Nothing to be done for tda2xx c66xdsp_1 vps_examples_utility
Nothing to be done for tda2xx c66xdsp_1 bsp_i2c
Nothing to be done for tda2xx c66xdsp_1 bsp_uart
Nothing to be done for tda2xx c66xdsp_1 bsp_mcspi
Nothing to be done for tda2xx c66xdsp_2 csl_init
Nothing to be done for tda2xx csl_intc
Nothing to be done for tda2xx c66xdsp_2 csl
Nothing to be done for tda2xx c66xdsp_2 csl_utils_common
Nothing to be done for tda2xx c66xdsp_2 csl_uart_console
Nothing to be done for tda2xx c66xdsp_2 csl_utils_i2c
Nothing to be done for tda2xx c66xdsp_2 pm_hal
Nothing to be done for tda2xx c66xdsp_2 pm_hal_optimized
Nothing to be done for tda2xx c66xdsp_2 pm_lib
Nothing to be done for tda2xx c66xdsp_2 pm_lib_optimized
Nothing to be done for tda2xx pm_rtos
Nothing to be done for tda2xx c66xdsp_2 sbl_lib
Nothing to be done for tda2xx c66xdsp_2 sbl_utils
Nothing to be done for tda2xx c66xdsp_2 diag
Nothing to be done for tda2xx c66xdsp_2 firewall_l3l4
Nothing to be done for tda2xx c66xdsp_2 norflash_lib
Nothing to be done for tda2xx c66xdsp_2 qspiflash_lib
Nothing to be done for tda2xx c66xdsp_2 i2c_lld
Nothing to be done for tda2xx c66xdsp_2 stw_platform
Nothing to be done for tda2xx c66xdsp_2 stw_uartconsole
Nothing to be done for tda2xx c66xdsp_2 stw_fatlib
Nothing to be done for tda2xx c66xdsp_2 stw_fatlib_edma
Nothing to be done for tda2xx c66xdsp_2 stw_boards
Nothing to be done for tda2xx c66xdsp_2 stw_devices
Nothing to be done for tda2xx c66xdsp_2 stw_examples_utility
Nothing to be done for tda2xx c66xdsp_2 vps_common
Nothing to be done for tda2xx c66xdsp_2 vpslib
Nothing to be done for tda2xx c66xdsp_2 vpsdrv_baremetal
Nothing to be done for tda2xx c66xdsp_2 fvid2
Nothing to be done for tda2xx c66xdsp_2 vps_osal_tirtos
Nothing to be done for tda2xx c66xdsp_2 vps_osal_tirtos_smp
Nothing to be done for tda2xx c66xdsp_2 vpsdrv
Nothing to be done for tda2xx c66xdsp_2 vps_platforms
Nothing to be done for tda2xx c66xdsp_2 vps_devices
Nothing to be done for tda2xx c66xdsp_2 vps_boards
Nothing to be done for tda2xx c66xdsp_2 vps_examples_utility
Nothing to be done for tda2xx c66xdsp_2 bsp_i2c
Nothing to be done for tda2xx c66xdsp_2 bsp_uart
Nothing to be done for tda2xx c66xdsp_2 bsp_mcspi
Nothing to be done for tda2xx arp32_1 csl_init
Nothing to be done for tda2xx csl_intc
Nothing to be done for tda2xx arp32_1 sbl_utils
Nothing to be done for tda2xx pm_rtos
Nothing to be done for tda2xx arp32_1 norflash_lib
Nothing to be done for tda2xx arp32_1 sbl_lib
Nothing to be done for tda2xx arp32_1 i2c_lld
Nothing to be done for tda2xx arp32_1 diag
Nothing to be done for tda2xx arp32_1 qspiflash_lib
Nothing to be done for tda2xx arp32_1 stw_fatlib
Nothing to be done for tda2xx arp32_1 stw_fatlib_edma
Nothing to be done for tda2xx arp32_1 vps_osal_baremetal
Nothing to be done for tda2xx arp32_1 stw_boards
Nothing to be done for tda2xx arp32_1 vps_common
Nothing to be done for tda2xx arp32_1 stw_devices
Nothing to be done for tda2xx arp32_1 vpslib
Nothing to be done for tda2xx arp32_1 vpsdrv_baremetal
Nothing to be done for tda2xx arp32_1 vps_devices
Nothing to be done for tda2xx arp32_1 vps_examples_utility
Nothing to be done for tda2xx arp32_1 vps_osal_tirtos_smp
Nothing to be done for tda2xx arp32_1 fvid2
Nothing to be done for tda2xx arp32_1 bsp_mcspi
Nothing to be done for tda2xx arp32_1 bsp_i2c
Nothing to be done for tda2xx arp32_1 bsp_uart
Nothing to be done for tda2xx arp32_1 vpsdrv
Nothing to be done for tda2xx arp32_1 vps_platforms
Nothing to be done for tda2xx arp32_1 vps_boards
Nothing to be done for tda2xx arp32_2 csl_init
Nothing to be done for tda2xx csl_intc
Nothing to be done for tda2xx arp32_2 csl
Nothing to be done for tda2xx arp32_2 csl_utils_common
Nothing to be done for tda2xx arp32_2 csl_uart_console
Nothing to be done for tda2xx arp32_2 csl_utils_i2c
Nothing to be done for tda2xx arp32_2 pm_hal
Nothing to be done for tda2xx arp32_2 pm_hal_optimized
Nothing to be done for tda2xx arp32_2 pm_lib
Nothing to be done for tda2xx arp32_2 pm_lib_optimized
Nothing to be done for tda2xx pm_rtos
Nothing to be done for tda2xx arp32_2 sbl_lib
Nothing to be done for tda2xx arp32_2 sbl_utils
Nothing to be done for tda2xx arp32_2 diag
Nothing to be done for tda2xx arp32_2 firewall_l3l4
Nothing to be done for tda2xx arp32_2 norflash_lib
Nothing to be done for tda2xx arp32_2 qspiflash_lib
Nothing to be done for tda2xx arp32_2 i2c_lld
Nothing to be done for tda2xx arp32_2 stw_platform
Nothing to be done for tda2xx arp32_2 stw_uartconsole
Nothing to be done for tda2xx arp32_2 stw_fatlib
Nothing to be done for tda2xx arp32_2 stw_fatlib_edma
Nothing to be done for tda2xx arp32_2 stw_boards
Nothing to be done for tda2xx arp32_2 stw_devices
Nothing to be done for tda2xx arp32_2 stw_examples_utility
Nothing to be done for tda2xx arp32_2 vps_osal_baremetal
Nothing to be done for tda2xx arp32_2 vps_common
Nothing to be done for tda2xx arp32_2 vpslib
Nothing to be done for tda2xx arp32_2 vpsdrv_baremetal
Nothing to be done for tda2xx arp32_2 fvid2
Nothing to be done for tda2xx arp32_2 vps_osal_tirtos
Nothing to be done for tda2xx arp32_2 vps_osal_tirtos_smp
Nothing to be done for tda2xx arp32_2 vpsdrv
Nothing to be done for tda2xx arp32_2 vps_platforms
Nothing to be done for tda2xx arp32_2 vps_devices
Nothing to be done for tda2xx arp32_2 vps_boards
Nothing to be done for tda2xx arp32_2 vps_examples_utility
Nothing to be done for tda2xx arp32_2 bsp_i2c
Nothing to be done for tda2xx arp32_2 bsp_uart
Nothing to be done for tda2xx arp32_2 bsp_mcspi
Nothing to be done for tda2xx arp32_3 csl_init
Nothing to be done for tda2xx csl_intc
Nothing to be done for tda2xx arp32_3 csl
Nothing to be done for tda2xx arp32_3 csl_utils_common
Nothing to be done for tda2xx arp32_3 csl_uart_console
Nothing to be done for tda2xx arp32_3 csl_utils_i2c
Nothing to be done for tda2xx arp32_3 pm_hal
Nothing to be done for tda2xx arp32_3 pm_hal_optimized
Nothing to be done for tda2xx arp32_3 pm_lib
Nothing to be done for tda2xx arp32_3 pm_lib_optimized
Nothing to be done for tda2xx pm_rtos
Nothing to be done for tda2xx arp32_3 sbl_lib
Nothing to be done for tda2xx arp32_3 sbl_utils
Nothing to be done for tda2xx arp32_3 diag
Nothing to be done for tda2xx arp32_3 firewall_l3l4
Nothing to be done for tda2xx arp32_3 norflash_lib
Nothing to be done for tda2xx arp32_3 qspiflash_lib
Nothing to be done for tda2xx arp32_3 i2c_lld
Nothing to be done for tda2xx arp32_3 stw_platform
Nothing to be done for tda2xx arp32_3 stw_uartconsole
Nothing to be done for tda2xx arp32_3 stw_fatlib
Nothing to be done for tda2xx arp32_3 stw_fatlib_edma
Nothing to be done for tda2xx arp32_3 stw_boards
Nothing to be done for tda2xx arp32_3 stw_devices
Nothing to be done for tda2xx arp32_3 stw_examples_utility
Nothing to be done for tda2xx arp32_3 vps_osal_baremetal
Nothing to be done for tda2xx arp32_3 vps_common
Nothing to be done for tda2xx arp32_3 vpslib
Nothing to be done for tda2xx arp32_3 vpsdrv_baremetal
Nothing to be done for tda2xx arp32_3 fvid2
Nothing to be done for tda2xx arp32_3 vps_osal_tirtos
Nothing to be done for tda2xx arp32_3 vps_osal_tirtos_smp
Nothing to be done for tda2xx arp32_3 vpsdrv
Nothing to be done for tda2xx arp32_3 vps_platforms
Nothing to be done for tda2xx arp32_3 vps_devices
Nothing to be done for tda2xx arp32_3 vps_boards
Nothing to be done for tda2xx arp32_3 vps_examples_utility
Nothing to be done for tda2xx arp32_3 bsp_i2c
Nothing to be done for tda2xx arp32_3 bsp_uart
Nothing to be done for tda2xx arp32_3 bsp_mcspi
Nothing to be done for tda2xx arp32_4 csl_init
Nothing to be done for tda2xx csl_intc
Nothing to be done for tda2xx arp32_4 csl
Nothing to be done for tda2xx arp32_4 csl_utils_common
Nothing to be done for tda2xx arp32_4 csl_uart_console
Nothing to be done for tda2xx arp32_4 csl_utils_i2c
Nothing to be done for tda2xx arp32_4 pm_hal
Nothing to be done for tda2xx arp32_4 pm_hal_optimized
Nothing to be done for tda2xx arp32_4 pm_lib
Nothing to be done for tda2xx arp32_4 pm_lib_optimized
Nothing to be done for tda2xx pm_rtos
Nothing to be done for tda2xx arp32_4 sbl_lib
Nothing to be done for tda2xx arp32_4 sbl_utils
Nothing to be done for tda2xx arp32_4 diag
Nothing to be done for tda2xx arp32_4 firewall_l3l4
Nothing to be done for tda2xx arp32_4 norflash_lib
Nothing to be done for tda2xx arp32_4 qspiflash_lib
Nothing to be done for tda2xx arp32_4 i2c_lld
Nothing to be done for tda2xx arp32_4 stw_platform
Nothing to be done for tda2xx arp32_4 stw_uartconsole
Nothing to be done for tda2xx arp32_4 stw_fatlib
Nothing to be done for tda2xx arp32_4 stw_fatlib_edma
Nothing to be done for tda2xx arp32_4 stw_boards
Nothing to be done for tda2xx arp32_4 stw_devices
Nothing to be done for tda2xx arp32_4 stw_examples_utility
Nothing to be done for tda2xx arp32_4 vps_osal_baremetal
Nothing to be done for tda2xx arp32_4 vps_common
Nothing to be done for tda2xx arp32_4 vpslib
Nothing to be done for tda2xx arp32_4 vpsdrv_baremetal
Nothing to be done for tda2xx arp32_4 fvid2
Nothing to be done for tda2xx arp32_4 vps_osal_tirtos
Nothing to be done for tda2xx arp32_4 vps_osal_tirtos_smp
Nothing to be done for tda2xx arp32_4 vpsdrv
Nothing to be done for tda2xx arp32_4 vps_platforms
Nothing to be done for tda2xx arp32_4 vps_devices
Nothing to be done for tda2xx arp32_4 vps_boards
Nothing to be done for tda2xx arp32_4 vps_examples_utility
Nothing to be done for tda2xx arp32_4 bsp_i2c
Nothing to be done for tda2xx arp32_4 bsp_uart
Nothing to be done for tda2xx arp32_4 bsp_mcspi
# Depend tda2xx-evm:ipu2:release:links_common_algorithm
# Depend tda2xx-evm:c66xdsp_1:release:links_common_algorithm
# Depend tda2xx-evm:c66xdsp_2:release:links_common_algorithm
# Depend tda2xx-evm:arp32_1:release:links_common_algorithm
# Depend tda2xx-evm:arp32_2:release:links_common_algorithm
# Depend tda2xx-evm:arp32_3:release:links_common_algorithm
# Depend tda2xx-evm:arp32_4:release:links_common_algorithm
# Depend tda2xx-evm:ipu2:release:links_common_dup
# Depend tda2xx-evm:c66xdsp_1:release:links_common_dup
# Depend tda2xx-evm:c66xdsp_2:release:links_common_dup
# Depend tda2xx-evm:arp32_1:release:links_common_dup
# Depend tda2xx-evm:arp32_2:release:links_common_dup
# Depend tda2xx-evm:arp32_3:release:links_common_dup
# Depend tda2xx-evm:arp32_4:release:links_common_dup
# Depend tda2xx-evm:ipu2:release:links_common_gate
# Depend tda2xx-evm:c66xdsp_1:release:links_common_gate
# Depend tda2xx-evm:c66xdsp_2:release:links_common_gate
# Depend tda2xx-evm:arp32_1:release:links_common_gate
# Depend tda2xx-evm:arp32_2:release:links_common_gate
# Depend tda2xx-evm:arp32_3:release:links_common_gate
# Depend tda2xx-evm:arp32_4:release:links_common_gate
# Depend tda2xx-evm:ipu2:release:links_common_ipcIn
# Depend tda2xx-evm:c66xdsp_1:release:links_common_ipcIn
# Depend tda2xx-evm:c66xdsp_2:release:links_common_ipcIn
# Depend tda2xx-evm:arp32_1:release:links_common_ipcIn
# Depend tda2xx-evm:arp32_2:release:links_common_ipcIn
# Depend tda2xx-evm:arp32_3:release:links_common_ipcIn
# Depend tda2xx-evm:arp32_4:release:links_common_ipcIn
# Depend tda2xx-evm:ipu2:release:links_common_ipcOut
# Depend tda2xx-evm:c66xdsp_1:release:links_common_ipcOut
# Depend tda2xx-evm:c66xdsp_2:release:links_common_ipcOut
# Depend tda2xx-evm:arp32_1:release:links_common_ipcOut
# Depend tda2xx-evm:arp32_2:release:links_common_ipcOut
# Depend tda2xx-evm:arp32_3:release:links_common_ipcOut
# Depend tda2xx-evm:arp32_4:release:links_common_ipcOut
# Depend tda2xx-evm:ipu2:release:links_common_merge
# Depend tda2xx-evm:c66xdsp_1:release:links_common_merge
# Depend tda2xx-evm:c66xdsp_2:release:links_common_merge
# Depend tda2xx-evm:arp32_1:release:links_common_merge
# Depend tda2xx-evm:arp32_2:release:links_common_merge
# Depend tda2xx-evm:arp32_3:release:links_common_merge
# Depend tda2xx-evm:arp32_4:release:links_common_merge
# Depend tda2xx-evm:ipu2:release:links_common_null
# Depend tda2xx-evm:c66xdsp_1:release:links_common_null
# Depend tda2xx-evm:c66xdsp_2:release:links_common_null
# Depend tda2xx-evm:arp32_1:release:links_common_null
# Depend tda2xx-evm:arp32_2:release:links_common_null
# Depend tda2xx-evm:arp32_3:release:links_common_null
# Depend tda2xx-evm:arp32_4:release:links_common_null
# Depend tda2xx-evm:ipu2:release:links_common_network_tx
# Depend tda2xx-evm:c66xdsp_1:release:links_common_network_tx
# Depend tda2xx-evm:c66xdsp_2:release:links_common_network_tx
# Depend tda2xx-evm:arp32_1:release:links_common_network_tx
# Depend tda2xx-evm:arp32_2:release:links_common_network_tx
# Depend tda2xx-evm:arp32_3:release:links_common_network_tx
# Depend tda2xx-evm:arp32_4:release:links_common_network_tx
# Depend tda2xx-evm:ipu2:release:links_common_network_rx
# Depend tda2xx-evm:ipu2:release:links_common_nullSrc
# Depend tda2xx-evm:ipu2:release:links_common_select
# Depend tda2xx-evm:c66xdsp_1:release:links_common_select
# Depend tda2xx-evm:c66xdsp_2:release:links_common_select
# Depend tda2xx-evm:arp32_1:release:links_common_select
# Depend tda2xx-evm:arp32_2:release:links_common_select
# Depend tda2xx-evm:arp32_3:release:links_common_select
# Depend tda2xx-evm:arp32_4:release:links_common_select
# Depend tda2xx-evm:ipu2:release:links_common_sync
# Depend tda2xx-evm:c66xdsp_1:release:links_common_sync
# Depend tda2xx-evm:c66xdsp_2:release:links_common_sync
# Depend tda2xx-evm:arp32_1:release:links_common_sync
# Depend tda2xx-evm:arp32_2:release:links_common_sync
# Depend tda2xx-evm:arp32_3:release:links_common_sync
# Depend tda2xx-evm:arp32_4:release:links_common_sync
# Depend tda2xx-evm:ipu2:release:links_ipu_display
# Depend tda2xx-evm:ipu2:release:links_ipu_display_ctrl
# Depend tda2xx-evm:ipu2:release:links_ipu_iva
# Depend tda2xx-evm:ipu2:release:links_ipu_vip_capture
# Depend tda2xx-evm:ipu2:release:links_ipu_vpe
# Depend tda2xx-evm:ipu2:release:links_ipu_dssM2mWb
# Depend tda2xx-evm:ipu2:release:utils_common
# Depend tda2xx-evm:c66xdsp_1:release:utils_common
# Depend tda2xx-evm:c66xdsp_2:release:utils_common
# Depend tda2xx-evm:arp32_1:release:utils_common
# Depend tda2xx-evm:arp32_2:release:utils_common
# Depend tda2xx-evm:arp32_3:release:utils_common
# Depend tda2xx-evm:arp32_4:release:utils_common
# Depend tda2xx-evm:ipu2:release:links_common_system
# Depend tda2xx-evm:c66xdsp_1:release:links_common_system
# Depend tda2xx-evm:c66xdsp_2:release:links_common_system
# Depend tda2xx-evm:arp32_1:release:links_common_system
# Depend tda2xx-evm:arp32_2:release:links_common_system
# Depend tda2xx-evm:arp32_3:release:links_common_system
# Depend tda2xx-evm:arp32_4:release:links_common_system
# Depend tda2xx-evm:c66xdsp_1:release:links_dsp_system
# Depend tda2xx-evm:c66xdsp_2:release:links_dsp_system
# Depend tda2xx-evm:arp32_1:release:links_eve_system
# Depend tda2xx-evm:arp32_2:release:links_eve_system
# Depend tda2xx-evm:arp32_3:release:links_eve_system
# Depend tda2xx-evm:arp32_4:release:links_eve_system
# Depend tda2xx-evm:ipu2:release:links_ipu_system
SHELL=/bin/sh
TARGET_MAKEFILES=/home/yoav/PROCESSOR_SDK_VISION_03_07_00_00/vision_sdk/apps/src/rtos/alg_plugins/openvx/dms_kernel/kernels/dms/c66/bam/concerto.mak /home/yoav/PROCESSOR_SDK_VISION_03_07_00_00/vision_sdk/apps/src/rtos/alg_plugins/openvx/dms_kernel/kernels/dms/c66/concerto.mak /home/yoav/PROCESSOR_SDK_VISION_03_07_00_00/vision_sdk/apps/src/rtos/alg_plugins/openvx/dms_kernel/kernels/dms/host/concerto.mak /home/yoav/PROCESSOR_SDK_VISION_03_07_00_00/vision_sdk/apps/src/rtos/alg_plugins/openvx/dms_kernel/kernels/dms/test/concerto.mak conformance_tests/kernels/test_kernels/arm/concerto.mak conformance_tests/kernels/test_kernels/c66/bam/concerto.mak conformance_tests/kernels/test_kernels/c66/concerto.mak conformance_tests/kernels/test_kernels/host/concerto.mak conformance_tests/kernels/test_kernels/test/concerto.mak conformance_tests/test_conformance/concerto.mak conformance_tests/test_conformance/test_module/concerto.mak conformance_tests/test_engine/concerto.mak conformance_tests/test_executable/concerto.mak conformance_tests/test_tiovx/concerto.mak kernels/common/host/concerto.mak kernels/common/target/concerto.mak kernels/ivision/common/concerto.mak kernels/ivision/eve/concerto.mak kernels/ivision/host/concerto.mak kernels/ivision/test/concerto.mak kernels/openvx-core/c66x/bam/concerto.mak kernels/openvx-core/c66x/concerto.mak kernels/openvx-core/host/concerto.mak kernels/tidl/host/concerto.mak kernels/tidl/target/concerto.mak kernels/tidl/test/concerto.mak source/framework/concerto.mak source/platform/pc/linux/concerto.mak source/platform/pc/windows/concerto.mak source/platform/vision_sdk/bios/concerto.mak source/platform/vision_sdk/linux/concerto.mak source/vxu/concerto.mak tools/sample_use_cases/concerto.mak tutorial/ch00_main/concerto.mak tutorial/ch03_graph/c66x/concerto.mak tutorial/concerto.mak utils/source/concerto.mak
file TIARMCGT_ROOT=$(VSDK_TOOLS_PATH)/cg_tools/linux/ti-cgt-arm_16.9.2.LTS
undefined GCC_SYSBIOS_ARM_ROOT=
file CGT6X_ROOT=$(VSDK_TOOLS_PATH)/cg_tools/linux/ti-cgt-c6000_8.2.4
undefined CGT7X_ROOT=
undefined GCC_WINDOWS_ROOT=
file GCC_LINUX_ROOT=/usr/
#######################################################################
TARGET_COMBO=TDAX:SYSBIOS:M4:1:release:TIARMCGT
HOST_ROOT=/home/yoav/PROCESSOR_SDK_VISION_03_07_00_00/ti_components/open_compute/tiovx_01_05_01_00
HOST_COMPILER=TIARMCGT
HOST_PLATFORM=PC
HOST_OS=LINUX
HOST_CPU=x86_64
HOST_ARCH=64
HOST_FAMILY=x86_64
HOST_NUM_CORES=8
TARGET_OS=SYSBIOS
TARGET_CPU=M4
TARGET_ARCH=32
TARGET_FAMILY=ARM
TARGET_NUM_CORES=1
TARGET_PLATFORM=TDAX
TARGET_BUILD=release
TARGET_OUT=/home/yoav/PROCESSOR_SDK_VISION_03_07_00_00/ti_components/open_compute/tiovx_01_05_01_00/out/TDAX/M4/SYSBIOS/release
TARGET_DOC=/home/yoav/PROCESSOR_SDK_VISION_03_07_00_00/ti_components/open_compute/tiovx_01_05_01_00/out/TDAX/M4/SYSBIOS/release/docs
BUILD_DEFS = BUILD_IVISION_KERNELS CUSTOM_APPLICATION_PATH BUILD_TUTORIAL BUILD_CONFORMANCE_TEST
TDAX_SYSBIOS_M4_1_release_TIARMCGT_DEFS = SYSBIOS TDAX M4="M4" TARGET_NUM_CORES=1 TARGET_ARCH=32 ARCH_32 ARM TARGET_BUILD=1
TDAX_SYSBIOS_M4_1_release_TIARMCGT_LDIRS =
SCM_ROOT=
SCM_VERSION=
#######################################################################
TARGET_COMBO=TDAX:SYSBIOS:C66:1:release:CGT6X
HOST_ROOT=/home/yoav/PROCESSOR_SDK_VISION_03_07_00_00/ti_components/open_compute/tiovx_01_05_01_00
HOST_COMPILER=CGT6X
HOST_PLATFORM=PC
HOST_OS=LINUX
HOST_CPU=x86_64
HOST_ARCH=64
HOST_FAMILY=x86_64
HOST_NUM_CORES=8
TARGET_OS=SYSBIOS
TARGET_CPU=C66
TARGET_ARCH=32
TARGET_FAMILY=DSP
TARGET_NUM_CORES=1
TARGET_PLATFORM=TDAX
TARGET_BUILD=release
TARGET_OUT=/home/yoav/PROCESSOR_SDK_VISION_03_07_00_00/ti_components/open_compute/tiovx_01_05_01_00/out/TDAX/C66/SYSBIOS/release
TARGET_DOC=/home/yoav/PROCESSOR_SDK_VISION_03_07_00_00/ti_components/open_compute/tiovx_01_05_01_00/out/TDAX/C66/SYSBIOS/release/docs
BUILD_DEFS = BUILD_IVISION_KERNELS CUSTOM_APPLICATION_PATH BUILD_TUTORIAL BUILD_CONFORMANCE_TEST
TDAX_SYSBIOS_C66_1_release_CGT6X_DEFS = SYSBIOS TDAX C66="C66" TARGET_NUM_CORES=1 TARGET_ARCH=32 ARCH_32 DSP TARGET_BUILD=1
TDAX_SYSBIOS_C66_1_release_CGT6X_LDIRS =
SCM_ROOT=
SCM_VERSION=
#######################################################################
TARGET_COMBO=TDAX:SYSBIOS:EVE:1:release:ARP32CGT
HOST_ROOT=/home/yoav/PROCESSOR_SDK_VISION_03_07_00_00/ti_components/open_compute/tiovx_01_05_01_00
HOST_COMPILER=ARP32CGT
HOST_PLATFORM=PC
HOST_OS=LINUX
HOST_CPU=x86_64
HOST_ARCH=64
HOST_FAMILY=x86_64
HOST_NUM_CORES=8
TARGET_OS=SYSBIOS
TARGET_CPU=EVE
TARGET_ARCH=32
TARGET_FAMILY=EVE
TARGET_NUM_CORES=1
TARGET_PLATFORM=TDAX
TARGET_BUILD=release
TARGET_OUT=/home/yoav/PROCESSOR_SDK_VISION_03_07_00_00/ti_components/open_compute/tiovx_01_05_01_00/out/TDAX/EVE/SYSBIOS/release
TARGET_DOC=/home/yoav/PROCESSOR_SDK_VISION_03_07_00_00/ti_components/open_compute/tiovx_01_05_01_00/out/TDAX/EVE/SYSBIOS/release/docs
BUILD_DEFS = BUILD_IVISION_KERNELS CUSTOM_APPLICATION_PATH BUILD_TUTORIAL BUILD_CONFORMANCE_TEST
TDAX_SYSBIOS_EVE_1_release_ARP32CGT_DEFS = SYSBIOS TDAX EVE="EVE" TARGET_NUM_CORES=1 TARGET_ARCH=32 ARCH_32 TARGET_BUILD=1
TDAX_SYSBIOS_EVE_1_release_ARP32CGT_LDIRS =
SCM_ROOT=
SCM_VERSION=
#######################################################################
TARGET_COMBO=TDAX:SYSBIOS:A15:1:release:GCC
HOST_ROOT=/home/yoav/PROCESSOR_SDK_VISION_03_07_00_00/ti_components/open_compute/tiovx_01_05_01_00
HOST_COMPILER=GCC
HOST_PLATFORM=PC
HOST_OS=LINUX
HOST_CPU=x86_64
HOST_ARCH=64
HOST_FAMILY=x86_64
HOST_NUM_CORES=8
TARGET_OS=SYSBIOS
TARGET_CPU=A15
TARGET_ARCH=32
TARGET_FAMILY=ARM
TARGET_NUM_CORES=1
TARGET_PLATFORM=TDAX
TARGET_BUILD=release
TARGET_OUT=/home/yoav/PROCESSOR_SDK_VISION_03_07_00_00/ti_components/open_compute/tiovx_01_05_01_00/out/TDAX/A15/SYSBIOS/release
TARGET_DOC=/home/yoav/PROCESSOR_SDK_VISION_03_07_00_00/ti_components/open_compute/tiovx_01_05_01_00/out/TDAX/A15/SYSBIOS/release/docs
BUILD_DEFS = BUILD_IVISION_KERNELS CUSTOM_APPLICATION_PATH BUILD_TUTORIAL BUILD_CONFORMANCE_TEST
TDAX_SYSBIOS_A15_1_release_GCC_DEFS = SYSBIOS TDAX A15="A15" TARGET_NUM_CORES=1 TARGET_ARCH=32 ARCH_32 ARM TARGET_BUILD=1
TDAX_SYSBIOS_A15_1_release_GCC_LDIRS =
SCM_ROOT=
SCM_VERSION=
#######################################################################
TARGET_COMBO=TDAX:LINUX:A15:1:release:GCC_LINUX_ARM
HOST_ROOT=/home/yoav/PROCESSOR_SDK_VISION_03_07_00_00/ti_components/open_compute/tiovx_01_05_01_00
HOST_COMPILER=GCC_LINUX_ARM
HOST_PLATFORM=PC
HOST_OS=LINUX
HOST_CPU=x86_64
HOST_ARCH=64
HOST_FAMILY=x86_64
HOST_NUM_CORES=8
TARGET_OS=LINUX
TARGET_CPU=A15
TARGET_ARCH=32
TARGET_FAMILY=ARM
TARGET_NUM_CORES=1
TARGET_PLATFORM=TDAX
TARGET_BUILD=release
TARGET_OUT=/home/yoav/PROCESSOR_SDK_VISION_03_07_00_00/ti_components/open_compute/tiovx_01_05_01_00/out/TDAX/A15/LINUX/release
TARGET_DOC=/home/yoav/PROCESSOR_SDK_VISION_03_07_00_00/ti_components/open_compute/tiovx_01_05_01_00/out/TDAX/A15/LINUX/release/docs
BUILD_DEFS = BUILD_IVISION_KERNELS CUSTOM_APPLICATION_PATH BUILD_TUTORIAL BUILD_CONFORMANCE_TEST
TDAX_LINUX_A15_1_release_GCC_LINUX_ARM_DEFS = LINUX TDAX A15="A15" TARGET_NUM_CORES=1 TARGET_ARCH=32 ARCH_32 ARM TARGET_BUILD=1
TDAX_LINUX_A15_1_release_GCC_LINUX_ARM_LDIRS =
SCM_ROOT=
SCM_VERSION=
[GCC] Compiling C99 tivx_dms_node_api.c
[GCC] Compiling C99 vx_kernels_dms_host.c
Linking /home/yoav/PROCESSOR_SDK_VISION_03_07_00_00/ti_components/open_compute/tiovx_01_05_01_00/out/TDAX/A15/SYSBIOS/release/libvx_kernels_dms_tests.a
[GCC] Compiling C99 vx_apply_gain_host.c
make[3]: /home/yoav/PROCESSOR_SDK_VISION_03_07_00_00/ti_components/cg_tools/linux/gcc-arm-none-eabi-4_9-2015q3/bin/arm-none-eabi-ar: Command not found
/bin/sh: /home/yoav/PROCESSOR_SDK_VISION_03_07_00_00/ti_components/cg_tools/linux/gcc-arm-none-eabi-4_9-2015q3/bin/arm-none-eabi-gcc: No such file or directory
concerto/finale.mak:304: recipe for target '/home/yoav/PROCESSOR_SDK_VISION_03_07_00_00/ti_components/open_compute/tiovx_01_05_01_00/out/TDAX/A15/SYSBIOS/release/module/.home.yoav.PROCESSOR_SDK_VISION_03_07_00_00.vision_sdk.apps.src.rtos.alg_plugins.openvx.dms_kernel.kernels.dms.host/tivx_dms_node_api.o' failed
make[3]: *** [/home/yoav/PROCESSOR_SDK_VISION_03_07_00_00/ti_components/open_compute/tiovx_01_05_01_00/out/TDAX/A15/SYSBIOS/release/module/.home.yoav.PROCESSOR_SDK_VISION_03_07_00_00.vision_sdk.apps.src.rtos.alg_plugins.openvx.dms_kernel.kernels.dms.host/tivx_dms_node_api.o] Error 127
make[3]: *** Waiting for unfinished jobs....
/bin/sh: /home/yoav/PROCESSOR_SDK_VISION_03_07_00_00/ti_components/cg_tools/linux/gcc-arm-none-eabi-4_9-2015q3/bin/arm-none-eabi-gcc: No such file or directory
/bin/sh: /home/yoav/PROCESSOR_SDK_VISION_03_07_00_00/ti_components/cg_tools/linux/gcc-arm-none-eabi-4_9-2015q3/bin/arm-none-eabi-gcc: No such file or directory
concerto/finale.mak:304: recipe for target '/home/yoav/PROCESSOR_SDK_VISION_03_07_00_00/ti_components/open_compute/tiovx_01_05_01_00/out/TDAX/A15/SYSBIOS/release/module/.home.yoav.PROCESSOR_SDK_VISION_03_07_00_00.vision_sdk.apps.src.rtos.alg_plugins.openvx.dms_kernel.kernels.dms.host/vx_kernels_dms_host.o' failed
make[3]: *** [/home/yoav/PROCESSOR_SDK_VISION_03_07_00_00/ti_components/open_compute/tiovx_01_05_01_00/out/TDAX/A15/SYSBIOS/release/module/.home.yoav.PROCESSOR_SDK_VISION_03_07_00_00.vision_sdk.apps.src.rtos.alg_plugins.openvx.dms_kernel.kernels.dms.host/vx_kernels_dms_host.o] Error 127
concerto/finale.mak:304: recipe for target '/home/yoav/PROCESSOR_SDK_VISION_03_07_00_00/ti_components/open_compute/tiovx_01_05_01_00/out/TDAX/A15/SYSBIOS/release/module/.home.yoav.PROCESSOR_SDK_VISION_03_07_00_00.vision_sdk.apps.src.rtos.alg_plugins.openvx.dms_kernel.kernels.dms.host/vx_apply_gain_host.o' failed
make[3]: *** [/home/yoav/PROCESSOR_SDK_VISION_03_07_00_00/ti_components/open_compute/tiovx_01_05_01_00/out/TDAX/A15/SYSBIOS/release/module/.home.yoav.PROCESSOR_SDK_VISION_03_07_00_00.vision_sdk.apps.src.rtos.alg_plugins.openvx.dms_kernel.kernels.dms.host/vx_apply_gain_host.o] Error 127
build_tiovx.mk:18: recipe for target 'tiovx' failed
make[2]: *** [tiovx] Error 2
Makefile:359: recipe for target 'tiovx' failed
make[1]: *** [tiovx] Error 2
Makefile:274: recipe for target 'depend' failed
make: *** [depend] Error 2
yoav@yoav-Latitude-5490:~/PROCESSOR_SDK_VISION_03_07_00_00/vision_sdk/build$ make -s -j depend